{"text_format":"3","workbook":"xlsx","n_sheets":5,"sheets":["Auswertung","Statistik nach Autor(in)","Top 10 Bilder","Fotografen","online"],"not_rendered":{"images":6,"macros":1,"defined_names":1,"comments":1},"read":"whole","date_system":"1900"}

{"sheet":"Auswertung","index":0,"n_rows":190,"n_cols":46,"rows_kept":190,"merged":[[0,1,0,21],[0,22,0,25],[0,37,3,37],[0,40,3,40],[0,43,3,43]]}
[{"$nulls":38},"Platz 1",{"$f":"VERKETTEN_P1(AB5:AB190,CHAR(10))","v":"Glubschaugen.JPG von Nadja Cassim\nüber_den_Wolken-2.jpg von Oliver von Guérard"},null,"Platz 2",{"$f":"VERKETTEN_P1(AC5:AC190,CHAR(10))","v":""},null,"Platz 3",{"$f":"VERKETTEN_P1(AD5:AD190,CHAR(10))","v":"Turm im Nebel.JPG von Susanne Deinhardt"}]
[{"$nulls":38},"Bestes Bild",null,null,"Bestes Bild",null,null,"Bestes Bild"]
[{"$nulls":38},"Platz 1",{"$f":"VERKETTEN_P1('Statistik nach Autor(in)'!E6:'Statistik nach Autor(in)'!E35,CHAR(10))","v":"Oliver von Guérard"},null,"Platz 2",{"$f":"VERKETTEN_P1('Statistik nach Autor(in)'!F6:'Statistik nach Autor(in)'!F35,CHAR(10))","v":"Susanne Deinhardt"},null,"Platz 3",{"$f":"VERKETTEN_P1('Statistik nach Autor(in)'!G6:'Statistik nach Autor(in)'!G35,CHAR(10))","v":"Chris Finsterer\nJan Grünler"}]
[null,"Bildname","Juror 1","Juror 2","Juror 3","Juror 4","Juror 5","Juror 6","Juror 7","Juror 8","Juror 9","Juror 10","Juror 11","Juror 12","Juror 13","Juror 14","Juror 15","Juror 16","Juror 17","Juror 18","Juror 19","Juror 20","Punkte","Schnitt","Platz","Autor(in)","abwesend","Platz 1","Platz 2","Platz 3","Platz 4","Platz 5","Platz 6","Platz 7","Platz 8","Platz 9","Platz 10",null,"Bester Fotograf",null,null,"Bester Fotograf",null,null,"Bester Fotograf"]
[1,"Glubschaugen.JPG",9,0,7,10,10,10,8,10,{"$nulls":12},{"$f":"IF(Tabelle_Auswertung[[#This Row],[Bildname]]<>\"\",\n    IF(Tabelle_Auswertung[[#This Row],[abwesend]]=\"ja\",\n        SUM(Tabelle_Auswertung[[#This Row],[Juror 1]:[Juror 20]])/COUNT(Tabelle_Auswertung[[#This Row],[Juror 1]:[Juror 20]])*(COUNT(Tabelle_Auswertung[[#This Row],[Juror 1]:[Juror 20]])-1),\n        SUM(Tabelle_Auswertung[[#This Row],[Juror 1]:[Juror 20]])\n    ),\n\" - \")","v":64},{"$f":"IF(Tabelle_Auswertung[[#This Row],[Bildname]]<>\"\",IF(Tabelle_Auswertung[[#This Row],[Punkte]]>0,AVERAGE(Tabelle_Auswertung[[#This Row],[Juror 1]:[Juror 20]]),\" - \"),\" - \")","v":{"v":8,"d":"8.00 "}},{"$f":"IF(Tabelle_Auswertung[[#This Row],[Bildname]]<>\"\",IF(Tabelle_Auswertung[[#This Row],[Punkte]]>0,RANK(Tabelle_Auswertung[[#This Row],[Punkte]],[Punkte],0),\" - \"),\" - \")","v":1},"Nadja Cassim",null,{"$f":"IF(Tabelle_Auswertung[[#This Row],[Platz]]=1,CONCATENATE(Tabelle_Auswertung[[#This Row],[Bildname]],\" von \",Tabelle_Auswertung[[#This Row],[Autor(in)]]),\"\")","v":"Glubschaugen.JPG von Nadja Cassim"},{"$f":"IF(Tabelle_Auswertung[[#This Row],[Platz]]=2,CONCATENATE(Tabelle_Auswertung[[#This Row],[Bildname]],\" von \",Tabelle_Auswertung[[#This Row],[Autor(in)]]),\"\")","v":""},{"$f":"IF(Tabelle_Auswertung[[#This Row],[Platz]]=3,CONCATENATE(Tabelle_Auswertung[[#This Row],[Bildname]],\" von \",Tabelle_Auswertung[[#This Row],[Autor(in)]]),\"\")","v":""},{"$f":"IF(Tabelle_Auswertung[[#This Row],[Platz]]=4,CONCATENATE(Tabelle_Auswertung[[#This Row],[Bildname]],\" von \",Tabelle_Auswertung[[#This Row],[Autor(in)]]),\"\")","v":""},{"$f":"IF(Tabelle_Auswertung[[#This Row],[Platz]]=5,CONCATENATE(Tabelle_Auswertung[[#This Row],[Bildname]],\" von \",Tabelle_Auswertung[[#This Row],[Autor(in)]]),\"\")","v":""},{"$f":"IF(Tabelle_Auswertung[[#This Row],[Platz]]=6,CONCATENATE(Tabelle_Auswertung[[#This Row],[Bildname]],\" von \",Tabelle_Auswertung[[#This Row],[Autor(in)]]),\"\")","v":""},{"$f":"IF(Tabelle_Auswertung[[#This Row],[Platz]]=7,CONCATENATE(Tabelle_Auswertung[[#This Row],[Bildname]],\" von \",Tabelle_Auswertung[[#This Row],[Autor(in)]]),\"\")","v":""},{"$f":"IF(Tabelle_Auswertung[[#This Row],[Platz]]=8,CONCATENATE(Tabelle_Auswertung[[#This Row],[Bildname]],\" von \",Tabelle_Auswertung[[#This Row],[Autor(in)]]),\"\")","v":""},{"$f":"IF(Tabelle_Auswertung[[#This Row],[Platz]]=9,CONCATENATE(Tabelle_Auswertung[[#This Row],[Bildname]],\" von \",Tabelle_Auswertung[[#This Row],[Autor(in)]]),\"\")","v":""},{"$f":"IF(Tabelle_Auswertung[[#This Row],[Platz]]=10,CONCATENATE(Tabelle_Auswertung[[#This Row],[Bildname]],\" von \",Tabelle_Auswertung[[#This Row],[Autor(in)]]),\"\")","v":""}]
[2,"über_den_Wolken-2.jpg",8,9,9,10,10,10,0,8,{"$nulls":12},{"$f":"IF(Tabelle_Auswertung[[#This Row],[Bildname]]<>\"\",\n    IF(Tabelle_Auswertung[[#This Row],[abwesend]]=\"ja\",\n        SUM(Tabelle_Auswertung[[#This Row],[Juror 1]:[Juror 20]])/COUNT(Tabelle_Auswertung[[#This Row],[Juror 1]:[Juror 20]])*(COUNT(Tabelle_Auswertung[[#This Row],[Juror 1]:[Juror 20]])-1),\n        SUM(Tabelle_Auswertung[[#This Row],[Juror 1]:[Juror 20]])\n    ),\n\" - \")","v":64},{"$f":"IF(Tabelle_Auswertung[[#This Row],[Bildname]]<>\"\",IF(Tabelle_Auswertung[[#This Row],[Punkte]]>0,AVERAGE(Tabelle_Auswertung[[#This Row],[Juror 1]:[Juror 20]]),\" - \"),\" - \")","v":{"v":8,"d":"8.00 "}},{"$f":"IF(Tabelle_Auswertung[[#This Row],[Bildname]]<>\"\",IF(Tabelle_Auswertung[[#This Row],[Punkte]]>0,RANK(Tabelle_Auswertung[[#This Row],[Punkte]],[Punkte],0),\" - \"),\" - \")","v":1},"Oliver von Guérard",null,{"$f":"IF(Tabelle_Auswertung[[#This Row],[Platz]]=1,CONCATENATE(Tabelle_Auswertung[[#This Row],[Bildname]],\" von \",Tabelle_Auswertung[[#This Row],[Autor(in)]]),\"\")","v":"über_den_Wolken-2.jpg von Oliver von Guérard"},{"$f":"IF(Tabelle_Auswertung[[#This Row],[Platz]]=2,CONCATENATE(Tabelle_Auswertung[[#This Row],[Bildname]],\" von \",Tabelle_Auswertung[[#This Row],[Autor(in)]]),\"\")","v":""},{"$f":"IF(Tabelle_Auswertung[[#This Row],[Platz]]=3,CONCATENATE(Tabelle_Auswertung[[#This Row],[Bildname]],\" von \",Tabelle_Auswertung[[#This Row],[Autor(in)]]),\"\")","v":""},{"$f":"IF(Tabelle_Auswertung[[#This Row],[Platz]]=4,CONCATENATE(Tabelle_Auswertung[[#This Row],[Bildname]],\" von \",Tabelle_Auswertung[[#This Row],[Autor(in)]]),\"\")","v":""},{"$f":"IF(Tabelle_Auswertung[[#This Row],[Platz]]=5,CONCATENATE(Tabelle_Auswertung[[#This Row],[Bildname]],\" von \",Tabelle_Auswertung[[#This Row],[Autor(in)]]),\"\")","v":""},{"$f":"IF(Tabelle_Auswertung[[#This Row],[Platz]]=6,CONCATENATE(Tabelle_Auswertung[[#This Row],[Bildname]],\" von \",Tabelle_Auswertung[[#This Row],[Autor(in)]]),\"\")","v":""},{"$f":"IF(Tabelle_Auswertung[[#This Row],[Platz]]=7,CONCATENATE(Tabelle_Auswertung[[#This Row],[Bildname]],\" von \",Tabelle_Auswertung[[#This Row],[Autor(in)]]),\"\")","v":""},{"$f":"IF(Tabelle_Auswertung[[#This Row],[Platz]]=8,CONCATENATE(Tabelle_Auswertung[[#This Row],[Bildname]],\" von \",Tabelle_Auswertung[[#This Row],[Autor(in)]]),\"\")","v":""},{"$f":"IF(Tabelle_Auswertung[[#This Row],[Platz]]=9,CONCATENATE(Tabelle_Auswertung[[#This Row],[Bildname]],\" von \",Tabelle_Auswertung[[#This Row],[Autor(in)]]),\"\")","v":""},{"$f":"IF(Tabelle_Auswertung[[#This Row],[Platz]]=10,CONCATENATE(Tabelle_Auswertung[[#This Row],[Bildname]],\" von \",Tabelle_Auswertung[[#This Row],[Autor(in)]]),\"\")","v":""},null,"Eigenbewertung"]
[3,"Turm im Nebel.JPG",7,10,9,10,10,10,6,8,{"$nulls":12},{"$f":"IF(Tabelle_Auswertung[[#This Row],[Bildname]]<>\"\",\n    IF(Tabelle_Auswertung[[#This Row],[abwesend]]=\"ja\",\n        SUM(Tabelle_Auswertung[[#This Row],[Juror 1]:[Juror 20]])/COUNT(Tabelle_Auswertung[[#This Row],[Juror 1]:[Juror 20]])*(COUNT(Tabelle_Auswertung[[#This Row],[Juror 1]:[Juror 20]])-1),\n        SUM(Tabelle_Auswertung[[#This Row],[Juror 1]:[Juror 20]])\n    ),\n\" - \")","v":61.25},{"$f":"IF(Tabelle_Auswertung[[#This Row],[Bildname]]<>\"\",IF(Tabelle_Auswertung[[#This Row],[Punkte]]>0,AVERAGE(Tabelle_Auswertung[[#This Row],[Juror 1]:[Juror 20]]),\" - \"),\" - \")","v":8.75},{"$f":"IF(Tabelle_Auswertung[[#This Row],[Bildname]]<>\"\",IF(Tabelle_Auswertung[[#This Row],[Punkte]]>0,RANK(Tabelle_Auswertung[[#This Row],[Punkte]],[Punkte],0),\" - \"),\" - \")","v":3},"Susanne Deinhardt","ja",{"$f":"IF(Tabelle_Auswertung[[#This Row],[Platz]]=1,CONCATENATE(Tabelle_Auswertung[[#This Row],[Bildname]],\" von \",Tabelle_Auswertung[[#This Row],[Autor(in)]]),\"\")","v":""},{"$f":"IF(Tabelle_Auswertung[[#This Row],[Platz]]=2,CONCATENATE(Tabelle_Auswertung[[#This Row],[Bildname]],\" von \",Tabelle_Auswertung[[#This Row],[Autor(in)]]),\"\")","v":""},{"$f":"IF(Tabelle_Auswertung[[#This Row],[Platz]]=3,CONCATENATE(Tabelle_Auswertung[[#This Row],[Bildname]],\" von \",Tabelle_Auswertung[[#This Row],[Autor(in)]]),\"\")","v":"Turm im Nebel.JPG von Susanne Deinhardt"},{"$f":"IF(Tabelle_Auswertung[[#This Row],[Platz]]=4,CONCATENATE(Tabelle_Auswertung[[#This Row],[Bildname]],\" von \",Tabelle_Auswertung[[#This Row],[Autor(in)]]),\"\")","v":""},{"$f":"IF(Tabelle_Auswertung[[#This Row],[Platz]]=5,CONCATENATE(Tabelle_Auswertung[[#This Row],[Bildname]],\" von \",Tabelle_Auswertung[[#This Row],[Autor(in)]]),\"\")","v":""},{"$f":"IF(Tabelle_Auswertung[[#This Row],[Platz]]=6,CONCATENATE(Tabelle_Auswertung[[#This Row],[Bildname]],\" von \",Tabelle_Auswertung[[#This Row],[Autor(in)]]),\"\")","v":""},{"$f":"IF(Tabelle_Auswertung[[#This Row],[Platz]]=7,CONCATENATE(Tabelle_Auswertung[[#This Row],[Bildname]],\" von \",Tabelle_Auswertung[[#This Row],[Autor(in)]]),\"\")","v":""},{"$f":"IF(Tabelle_Auswertung[[#This Row],[Platz]]=8,CONCATENATE(Tabelle_Auswertung[[#This Row],[Bildname]],\" von \",Tabelle_Auswertung[[#This Row],[Autor(in)]]),\"\")","v":""},{"$f":"IF(Tabelle_Auswertung[[#This Row],[Platz]]=9,CONCATENATE(Tabelle_Auswertung[[#This Row],[Bildname]],\" von \",Tabelle_Auswertung[[#This Row],[Autor(in)]]),\"\")","v":""},{"$f":"IF(Tabelle_Auswertung[[#This Row],[Platz]]=10,CONCATENATE(Tabelle_Auswertung[[#This Row],[Bildname]],\" von \",Tabelle_Auswertung[[#This Row],[Autor(in)]]),\"\")","v":""}]
[4,"Flying Banana.jpg",7,8,8,8,0,10,9,10,{"$nulls":12},{"$f":"IF(Tabelle_Auswertung[[#This Row],[Bildname]]<>\"\",\n    IF(Tabelle_Auswertung[[#This Row],[abwesend]]=\"ja\",\n        SUM(Tabelle_Auswertung[[#This Row],[Juror 1]:[Juror 20]])/COUNT(Tabelle_Auswertung[[#This Row],[Juror 1]:[Juror 20]])*(COUNT(Tabelle_Auswertung[[#This Row],[Juror 1]:[Juror 20]])-1),\n        SUM(Tabelle_Auswertung[[#This Row],[Juror 1]:[Juror 20]])\n    ),\n\" - \")","v":60},{"$f":"IF(Tabelle_Auswertung[[#This Row],[Bildname]]<>\"\",IF(Tabelle_Auswertung[[#This Row],[Punkte]]>0,AVERAGE(Tabelle_Auswertung[[#This Row],[Juror 1]:[Juror 20]]),\" - \"),\" - \")","v":{"v":7.5,"d":"7.50 "}},{"$f":"IF(Tabelle_Auswertung[[#This Row],[Bildname]]<>\"\",IF(Tabelle_Auswertung[[#This Row],[Punkte]]>0,RANK(Tabelle_Auswertung[[#This Row],[Punkte]],[Punkte],0),\" - \"),\" - \")","v":4},"Jan Grünler",null,{"$f":"IF(Tabelle_Auswertung[[#This Row],[Platz]]=1,CONCATENATE(Tabelle_Auswertung[[#This Row],[Bildname]],\" von \",Tabelle_Auswertung[[#This Row],[Autor(in)]]),\"\")","v":""},{"$f":"IF(Tabelle_Auswertung[[#This Row],[Platz]]=2,CONCATENATE(Tabelle_Auswertung[[#This Row],[Bildname]],\" von \",Tabelle_Auswertung[[#This Row],[Autor(in)]]),\"\")","v":""},{"$f":"IF(Tabelle_Auswertung[[#This Row],[Platz]]=3,CONCATENATE(Tabelle_Auswertung[[#This Row],[Bildname]],\" von \",Tabelle_Auswertung[[#This Row],[Autor(in)]]),\"\")","v":""},{"$f":"IF(Tabelle_Auswertung[[#This Row],[Platz]]=4,CONCATENATE(Tabelle_Auswertung[[#This Row],[Bildname]],\" von \",Tabelle_Auswertung[[#This Row],[Autor(in)]]),\"\")","v":"Flying Banana.jpg von Jan Grünler"},{"$f":"IF(Tabelle_Auswertung[[#This Row],[Platz]]=5,CONCATENATE(Tabelle_Auswertung[[#This Row],[Bildname]],\" von \",Tabelle_Auswertung[[#This Row],[Autor(in)]]),\"\")","v":""},{"$f":"IF(Tabelle_Auswertung[[#This Row],[Platz]]=6,CONCATENATE(Tabelle_Auswertung[[#This Row],[Bildname]],\" von \",Tabelle_Auswertung[[#This Row],[Autor(in)]]),\"\")","v":""},{"$f":"IF(Tabelle_Auswertung[[#This Row],[Platz]]=7,CONCATENATE(Tabelle_Auswertung[[#This Row],[Bildname]],\" von \",Tabelle_Auswertung[[#This Row],[Autor(in)]]),\"\")","v":""},{"$f":"IF(Tabelle_Auswertung[[#This Row],[Platz]]=8,CONCATENATE(Tabelle_Auswertung[[#This Row],[Bildname]],\" von \",Tabelle_Auswertung[[#This Row],[Autor(in)]]),\"\")","v":""},{"$f":"IF(Tabelle_Auswertung[[#This Row],[Platz]]=9,CONCATENATE(Tabelle_Auswertung[[#This Row],[Bildname]],\" von \",Tabelle_Auswertung[[#This Row],[Autor(in)]]),\"\")","v":""},{"$f":"IF(Tabelle_Auswertung[[#This Row],[Platz]]=10,CONCATENATE(Tabelle_Auswertung[[#This Row],[Bildname]],\" von \",Tabelle_Auswertung[[#This Row],[Autor(in)]]),\"\")","v":""}]
[5,"tower bridge.jpg",8,10,7,10,9,9,6,0,{"$nulls":12},{"$f":"IF(Tabelle_Auswertung[[#This Row],[Bildname]]<>\"\",\n    IF(Tabelle_Auswertung[[#This Row],[abwesend]]=\"ja\",\n        SUM(Tabelle_Auswertung[[#This Row],[Juror 1]:[Juror 20]])/COUNT(Tabelle_Auswertung[[#This Row],[Juror 1]:[Juror 20]])*(COUNT(Tabelle_Auswertung[[#This Row],[Juror 1]:[Juror 20]])-1),\n        SUM(Tabelle_Auswertung[[#This Row],[Juror 1]:[Juror 20]])\n    ),\n\" - \")","v":59},{"$f":"IF(Tabelle_Auswertung[[#This Row],[Bildname]]<>\"\",IF(Tabelle_Auswertung[[#This Row],[Punkte]]>0,AVERAGE(Tabelle_Auswertung[[#This Row],[Juror 1]:[Juror 20]]),\" - \"),\" - \")","v":{"v":7.375,"d":"7.38 "}},{"$f":"IF(Tabelle_Auswertung[[#This Row],[Bildname]]<>\"\",IF(Tabelle_Auswertung[[#This Row],[Punkte]]>0,RANK(Tabelle_Auswertung[[#This Row],[Punkte]],[Punkte],0),\" - \"),\" - \")","v":5},"Gerhard Rieß",null,{"$f":"IF(Tabelle_Auswertung[[#This Row],[Platz]]=1,CONCATENATE(Tabelle_Auswertung[[#This Row],[Bildname]],\" von \",Tabelle_Auswertung[[#This Row],[Autor(in)]]),\"\")","v":""},{"$f":"IF(Tabelle_Auswertung[[#This Row],[Platz]]=2,CONCATENATE(Tabelle_Auswertung[[#This Row],[Bildname]],\" von \",Tabelle_Auswertung[[#This Row],[Autor(in)]]),\"\")","v":""},{"$f":"IF(Tabelle_Auswertung[[#This Row],[Platz]]=3,CONCATENATE(Tabelle_Auswertung[[#This Row],[Bildname]],\" von \",Tabelle_Auswertung[[#This Row],[Autor(in)]]),\"\")","v":""},{"$f":"IF(Tabelle_Auswertung[[#This Row],[Platz]]=4,CONCATENATE(Tabelle_Auswertung[[#This Row],[Bildname]],\" von \",Tabelle_Auswertung[[#This Row],[Autor(in)]]),\"\")","v":""},{"$f":"IF(Tabelle_Auswertung[[#This Row],[Platz]]=5,CONCATENATE(Tabelle_Auswertung[[#This Row],[Bildname]],\" von \",Tabelle_Auswertung[[#This Row],[Autor(in)]]),\"\")","v":"tower bridge.jpg von Gerhard Rieß"},{"$f":"IF(Tabelle_Auswertung[[#This Row],[Platz]]=6,CONCATENATE(Tabelle_Auswertung[[#This Row],[Bildname]],\" von \",Tabelle_Auswertung[[#This Row],[Autor(in)]]),\"\")","v":""},{"$f":"IF(Tabelle_Auswertung[[#This Row],[Platz]]=7,CONCATENATE(Tabelle_Auswertung[[#This Row],[Bildname]],\" von \",Tabelle_Auswertung[[#This Row],[Autor(in)]]),\"\")","v":""},{"$f":"IF(Tabelle_Auswertung[[#This Row],[Platz]]=8,CONCATENATE(Tabelle_Auswertung[[#This Row],[Bildname]],\" von \",Tabelle_Auswertung[[#This Row],[Autor(in)]]),\"\")","v":""},{"$f":"IF(Tabelle_Auswertung[[#This Row],[Platz]]=9,CONCATENATE(Tabelle_Auswertung[[#This Row],[Bildname]],\" von \",Tabelle_Auswertung[[#This Row],[Autor(in)]]),\"\")","v":""},{"$f":"IF(Tabelle_Auswertung[[#This Row],[Platz]]=10,CONCATENATE(Tabelle_Auswertung[[#This Row],[Bildname]],\" von \",Tabelle_Auswertung[[#This Row],[Autor(in)]]),\"\")","v":""}]
[6,"Löwenzahn.jpg",8,10,8,10,9,8,6,8,{"$nulls":12},{"$f":"IF(Tabelle_Auswertung[[#This Row],[Bildname]]<>\"\",\n    IF(Tabelle_Auswertung[[#This Row],[abwesend]]=\"ja\",\n        SUM(Tabelle_Auswertung[[#This Row],[Juror 1]:[Juror 20]])/COUNT(Tabelle_Auswertung[[#This Row],[Juror 1]:[Juror 20]])*(COUNT(Tabelle_Auswertung[[#This Row],[Juror 1]:[Juror 20]])-1),\n        SUM(Tabelle_Auswertung[[#This Row],[Juror 1]:[Juror 20]])\n    ),\n\" - \")","v":58.625},{"$f":"IF(Tabelle_Auswertung[[#This Row],[Bildname]]<>\"\",IF(Tabelle_Auswertung[[#This Row],[Punkte]]>0,AVERAGE(Tabelle_Auswertung[[#This Row],[Juror 1]:[Juror 20]]),\" - \"),\" - \")","v":{"v":8.375,"d":"8.38 "}},{"$f":"IF(Tabelle_Auswertung[[#This Row],[Bildname]]<>\"\",IF(Tabelle_Auswertung[[#This Row],[Punkte]]>0,RANK(Tabelle_Auswertung[[#This Row],[Punkte]],[Punkte],0),\" - \"),\" - \")","v":6},"Susanne Deinhardt","ja",{"$f":"IF(Tabelle_Auswertung[[#This Row],[Platz]]=1,CONCATENATE(Tabelle_Auswertung[[#This Row],[Bildname]],\" von \",Tabelle_Auswertung[[#This Row],[Autor(in)]]),\"\")","v":""},{"$f":"IF(Tabelle_Auswertung[[#This Row],[Platz]]=2,CONCATENATE(Tabelle_Auswertung[[#This Row],[Bildname]],\" von \",Tabelle_Auswertung[[#This Row],[Autor(in)]]),\"\")","v":""},{"$f":"IF(Tabelle_Auswertung[[#This Row],[Platz]]=3,CONCATENATE(Tabelle_Auswertung[[#This Row],[Bildname]],\" von \",Tabelle_Auswertung[[#This Row],[Autor(in)]]),\"\")","v":""},{"$f":"IF(Tabelle_Auswertung[[#This Row],[Platz]]=4,CONCATENATE(Tabelle_Auswertung[[#This Row],[Bildname]],\" von \",Tabelle_Auswertung[[#This Row],[Autor(in)]]),\"\")","v":""},{"$f":"IF(Tabelle_Auswertung[[#This Row],[Platz]]=5,CONCATENATE(Tabelle_Auswertung[[#This Row],[Bildname]],\" von \",Tabelle_Auswertung[[#This Row],[Autor(in)]]),\"\")","v":""},{"$f":"IF(Tabelle_Auswertung[[#This Row],[Platz]]=6,CONCATENATE(Tabelle_Auswertung[[#This Row],[Bildname]],\" von \",Tabelle_Auswertung[[#This Row],[Autor(in)]]),\"\")","v":"Löwenzahn.jpg von Susanne Deinhardt"},{"$f":"IF(Tabelle_Auswertung[[#This Row],[Platz]]=7,CONCATENATE(Tabelle_Auswertung[[#This Row],[Bildname]],\" von \",Tabelle_Auswertung[[#This Row],[Autor(in)]]),\"\")","v":""},{"$f":"IF(Tabelle_Auswertung[[#This Row],[Platz]]=8,CONCATENATE(Tabelle_Auswertung[[#This Row],[Bildname]],\" von \",Tabelle_Auswertung[[#This Row],[Autor(in)]]),\"\")","v":""},{"$f":"IF(Tabelle_Auswertung[[#This Row],[Platz]]=9,CONCATENATE(Tabelle_Auswertung[[#This Row],[Bildname]],\" von \",Tabelle_Auswertung[[#This Row],[Autor(in)]]),\"\")","v":""},{"$f":"IF(Tabelle_Auswertung[[#This Row],[Platz]]=10,CONCATENATE(Tabelle_Auswertung[[#This Row],[Bildname]],\" von \",Tabelle_Auswertung[[#This Row],[Autor(in)]]),\"\")","v":""}]
[7,"Rummel.jpg",10,9,7,0,8,9,7,8,{"$nulls":12},{"$f":"IF(Tabelle_Auswertung[[#This Row],[Bildname]]<>\"\",\n    IF(Tabelle_Auswertung[[#This Row],[abwesend]]=\"ja\",\n        SUM(Tabelle_Auswertung[[#This Row],[Juror 1]:[Juror 20]])/COUNT(Tabelle_Auswertung[[#This Row],[Juror 1]:[Juror 20]])*(COUNT(Tabelle_Auswertung[[#This Row],[Juror 1]:[Juror 20]])-1),\n        SUM(Tabelle_Auswertung[[#This Row],[Juror 1]:[Juror 20]])\n    ),\n\" - \")","v":58},{"$f":"IF(Tabelle_Auswertung[[#This Row],[Bildname]]<>\"\",IF(Tabelle_Auswertung[[#This Row],[Punkte]]>0,AVERAGE(Tabelle_Auswertung[[#This Row],[Juror 1]:[Juror 20]]),\" - \"),\" - \")","v":{"v":7.25,"d":"7.25 "}},{"$f":"IF(Tabelle_Auswertung[[#This Row],[Bildname]]<>\"\",IF(Tabelle_Auswertung[[#This Row],[Punkte]]>0,RANK(Tabelle_Auswertung[[#This Row],[Punkte]],[Punkte],0),\" - \"),\" - \")","v":7},"Chris Finsterer",null,{"$f":"IF(Tabelle_Auswertung[[#This Row],[Platz]]=1,CONCATENATE(Tabelle_Auswertung[[#This Row],[Bildname]],\" von \",Tabelle_Auswertung[[#This Row],[Autor(in)]]),\"\")","v":""},{"$f":"IF(Tabelle_Auswertung[[#This Row],[Platz]]=2,CONCATENATE(Tabelle_Auswertung[[#This Row],[Bildname]],\" von \",Tabelle_Auswertung[[#This Row],[Autor(in)]]),\"\")","v":""},{"$f":"IF(Tabelle_Auswertung[[#This Row],[Platz]]=3,CONCATENATE(Tabelle_Auswertung[[#This Row],[Bildname]],\" von \",Tabelle_Auswertung[[#This Row],[Autor(in)]]),\"\")","v":""},{"$f":"IF(Tabelle_Auswertung[[#This Row],[Platz]]=4,CONCATENATE(Tabelle_Auswertung[[#This Row],[Bildname]],\" von \",Tabelle_Auswertung[[#This Row],[Autor(in)]]),\"\")","v":""},{"$f":"IF(Tabelle_Auswertung[[#This Row],[Platz]]=5,CONCATENATE(Tabelle_Auswertung[[#This Row],[Bildname]],\" von \",Tabelle_Auswertung[[#This Row],[Autor(in)]]),\"\")","v":""},{"$f":"IF(Tabelle_Auswertung[[#This Row],[Platz]]=6,CONCATENATE(Tabelle_Auswertung[[#This Row],[Bildname]],\" von \",Tabelle_Auswertung[[#This Row],[Autor(in)]]),\"\")","v":""},{"$f":"IF(Tabelle_Auswertung[[#This Row],[Platz]]=7,CONCATENATE(Tabelle_Auswertung[[#This Row],[Bildname]],\" von \",Tabelle_Auswertung[[#This Row],[Autor(in)]]),\"\")","v":"Rummel.jpg von Chris Finsterer"},{"$f":"IF(Tabelle_Auswertung[[#This Row],[Platz]]=8,CONCATENATE(Tabelle_Auswertung[[#This Row],[Bildname]],\" von \",Tabelle_Auswertung[[#This Row],[Autor(in)]]),\"\")","v":""},{"$f":"IF(Tabelle_Auswertung[[#This Row],[Platz]]=9,CONCATENATE(Tabelle_Auswertung[[#This Row],[Bildname]],\" von \",Tabelle_Auswertung[[#This Row],[Autor(in)]]),\"\")","v":""},{"$f":"IF(Tabelle_Auswertung[[#This Row],[Platz]]=10,CONCATENATE(Tabelle_Auswertung[[#This Row],[Bildname]],\" von \",Tabelle_Auswertung[[#This Row],[Autor(in)]]),\"\")","v":""}]
[8,"wedding rings.jpg",8,8,9,10,0,8,6,9,{"$nulls":12},{"$f":"IF(Tabelle_Auswertung[[#This Row],[Bildname]]<>\"\",\n    IF(Tabelle_Auswertung[[#This Row],[abwesend]]=\"ja\",\n        SUM(Tabelle_Auswertung[[#This Row],[Juror 1]:[Juror 20]])/COUNT(Tabelle_Auswertung[[#This Row],[Juror 1]:[Juror 20]])*(COUNT(Tabelle_Auswertung[[#This Row],[Juror 1]:[Juror 20]])-1),\n        SUM(Tabelle_Auswertung[[#This Row],[Juror 1]:[Juror 20]])\n    ),\n\" - \")","v":58},{"$f":"IF(Tabelle_Auswertung[[#This Row],[Bildname]]<>\"\",IF(Tabelle_Auswertung[[#This Row],[Punkte]]>0,AVERAGE(Tabelle_Auswertung[[#This Row],[Juror 1]:[Juror 20]]),\" - \"),\" - \")","v":{"v":7.25,"d":"7.25 "}},{"$f":"IF(Tabelle_Auswertung[[#This Row],[Bildname]]<>\"\",IF(Tabelle_Auswertung[[#This Row],[Punkte]]>0,RANK(Tabelle_Auswertung[[#This Row],[Punkte]],[Punkte],0),\" - \"),\" - \")","v":7},"Jan Grünler",null,{"$f":"IF(Tabelle_Auswertung[[#This Row],[Platz]]=1,CONCATENATE(Tabelle_Auswertung[[#This Row],[Bildname]],\" von \",Tabelle_Auswertung[[#This Row],[Autor(in)]]),\"\")","v":""},{"$f":"IF(Tabelle_Auswertung[[#This Row],[Platz]]=2,CONCATENATE(Tabelle_Auswertung[[#This Row],[Bildname]],\" von \",Tabelle_Auswertung[[#This Row],[Autor(in)]]),\"\")","v":""},{"$f":"IF(Tabelle_Auswertung[[#This Row],[Platz]]=3,CONCATENATE(Tabelle_Auswertung[[#This Row],[Bildname]],\" von \",Tabelle_Auswertung[[#This Row],[Autor(in)]]),\"\")","v":""},{"$f":"IF(Tabelle_Auswertung[[#This Row],[Platz]]=4,CONCATENATE(Tabelle_Auswertung[[#This Row],[Bildname]],\" von \",Tabelle_Auswertung[[#This Row],[Autor(in)]]),\"\")","v":""},{"$f":"IF(Tabelle_Auswertung[[#This Row],[Platz]]=5,CONCATENATE(Tabelle_Auswertung[[#This Row],[Bildname]],\" von \",Tabelle_Auswertung[[#This Row],[Autor(in)]]),\"\")","v":""},{"$f":"IF(Tabelle_Auswertung[[#This Row],[Platz]]=6,CONCATENATE(Tabelle_Auswertung[[#This Row],[Bildname]],\" von \",Tabelle_Auswertung[[#This Row],[Autor(in)]]),\"\")","v":""},{"$f":"IF(Tabelle_Auswertung[[#This Row],[Platz]]=7,CONCATENATE(Tabelle_Auswertung[[#This Row],[Bildname]],\" von \",Tabelle_Auswertung[[#This Row],[Autor(in)]]),\"\")","v":"wedding rings.jpg von Jan Grünler"},{"$f":"IF(Tabelle_Auswertung[[#This Row],[Platz]]=8,CONCATENATE(Tabelle_Auswertung[[#This Row],[Bildname]],\" von \",Tabelle_Auswertung[[#This Row],[Autor(in)]]),\"\")","v":""},{"$f":"IF(Tabelle_Auswertung[[#This Row],[Platz]]=9,CONCATENATE(Tabelle_Auswertung[[#This Row],[Bildname]],\" von \",Tabelle_Auswertung[[#This Row],[Autor(in)]]),\"\")","v":""},{"$f":"IF(Tabelle_Auswertung[[#This Row],[Platz]]=10,CONCATENATE(Tabelle_Auswertung[[#This Row],[Bildname]],\" von \",Tabelle_Auswertung[[#This Row],[Autor(in)]]),\"\")","v":""}]
[9,"bright eyes.jpg",7,8,7,10,0,9,8,8,{"$nulls":12},{"$f":"IF(Tabelle_Auswertung[[#This Row],[Bildname]]<>\"\",\n    IF(Tabelle_Auswertung[[#This Row],[abwesend]]=\"ja\",\n        SUM(Tabelle_Auswertung[[#This Row],[Juror 1]:[Juror 20]])/COUNT(Tabelle_Auswertung[[#This Row],[Juror 1]:[Juror 20]])*(COUNT(Tabelle_Auswertung[[#This Row],[Juror 1]:[Juror 20]])-1),\n        SUM(Tabelle_Auswertung[[#This Row],[Juror 1]:[Juror 20]])\n    ),\n\" - \")","v":57},{"$f":"IF(Tabelle_Auswertung[[#This Row],[Bildname]]<>\"\",IF(Tabelle_Auswertung[[#This Row],[Punkte]]>0,AVERAGE(Tabelle_Auswertung[[#This Row],[Juror 1]:[Juror 20]]),\" - \"),\" - \")","v":{"v":7.125,"d":"7.13 "}},{"$f":"IF(Tabelle_Auswertung[[#This Row],[Bildname]]<>\"\",IF(Tabelle_Auswertung[[#This Row],[Punkte]]>0,RANK(Tabelle_Auswertung[[#This Row],[Punkte]],[Punkte],0),\" - \"),\" - \")","v":9},"Jan Grünler",null,{"$f":"IF(Tabelle_Auswertung[[#This Row],[Platz]]=1,CONCATENATE(Tabelle_Auswertung[[#This Row],[Bildname]],\" von \",Tabelle_Auswertung[[#This Row],[Autor(in)]]),\"\")","v":""},{"$f":"IF(Tabelle_Auswertung[[#This Row],[Platz]]=2,CONCATENATE(Tabelle_Auswertung[[#This Row],[Bildname]],\" von \",Tabelle_Auswertung[[#This Row],[Autor(in)]]),\"\")","v":""},{"$f":"IF(Tabelle_Auswertung[[#This Row],[Platz]]=3,CONCATENATE(Tabelle_Auswertung[[#This Row],[Bildname]],\" von \",Tabelle_Auswertung[[#This Row],[Autor(in)]]),\"\")","v":""},{"$f":"IF(Tabelle_Auswertung[[#This Row],[Platz]]=4,CONCATENATE(Tabelle_Auswertung[[#This Row],[Bildname]],\" von \",Tabelle_Auswertung[[#This Row],[Autor(in)]]),\"\")","v":""},{"$f":"IF(Tabelle_Auswertung[[#This Row],[Platz]]=5,CONCATENATE(Tabelle_Auswertung[[#This Row],[Bildname]],\" von \",Tabelle_Auswertung[[#This Row],[Autor(in)]]),\"\")","v":""},{"$f":"IF(Tabelle_Auswertung[[#This Row],[Platz]]=6,CONCATENATE(Tabelle_Auswertung[[#This Row],[Bildname]],\" von \",Tabelle_Auswertung[[#This Row],[Autor(in)]]),\"\")","v":""},{"$f":"IF(Tabelle_Auswertung[[#This Row],[Platz]]=7,CONCATENATE(Tabelle_Auswertung[[#This Row],[Bildname]],\" von \",Tabelle_Auswertung[[#This Row],[Autor(in)]]),\"\")","v":""},{"$f":"IF(Tabelle_Auswertung[[#This Row],[Platz]]=8,CONCATENATE(Tabelle_Auswertung[[#This Row],[Bildname]],\" von \",Tabelle_Auswertung[[#This Row],[Autor(in)]]),\"\")","v":""},{"$f":"IF(Tabelle_Auswertung[[#This Row],[Platz]]=9,CONCATENATE(Tabelle_Auswertung[[#This Row],[Bildname]],\" von \",Tabelle_Auswertung[[#This Row],[Autor(in)]]),\"\")","v":"bright eyes.jpg von Jan Grünler"},{"$f":"IF(Tabelle_Auswertung[[#This Row],[Platz]]=10,CONCATENATE(Tabelle_Auswertung[[#This Row],[Bildname]],\" von \",Tabelle_Auswertung[[#This Row],[Autor(in)]]),\"\")","v":""}]
[10,"Tropfen.JPG",8,10,8,10,9,7,6,7,{"$nulls":12},{"$f":"IF(Tabelle_Auswertung[[#This Row],[Bildname]]<>\"\",\n    IF(Tabelle_Auswertung[[#This Row],[abwesend]]=\"ja\",\n        SUM(Tabelle_Auswertung[[#This Row],[Juror 1]:[Juror 20]])/COUNT(Tabelle_Auswertung[[#This Row],[Juror 1]:[Juror 20]])*(COUNT(Tabelle_Auswertung[[#This Row],[Juror 1]:[Juror 20]])-1),\n        SUM(Tabelle_Auswertung[[#This Row],[Juror 1]:[Juror 20]])\n    ),\n\" - \")","v":56.875},{"$f":"IF(Tabelle_Auswertung[[#This Row],[Bildname]]<>\"\",IF(Tabelle_Auswertung[[#This Row],[Punkte]]>0,AVERAGE(Tabelle_Auswertung[[#This Row],[Juror 1]:[Juror 20]]),\" - \"),\" - \")","v":8.125},{"$f":"IF(Tabelle_Auswertung[[#This Row],[Bildname]]<>\"\",IF(Tabelle_Auswertung[[#This Row],[Punkte]]>0,RANK(Tabelle_Auswertung[[#This Row],[Punkte]],[Punkte],0),\" - \"),\" - \")","v":10},"Susanne Deinhardt","ja",{"$f":"IF(Tabelle_Auswertung[[#This Row],[Platz]]=1,CONCATENATE(Tabelle_Auswertung[[#This Row],[Bildname]],\" von \",Tabelle_Auswertung[[#This Row],[Autor(in)]]),\"\")","v":""},{"$f":"IF(Tabelle_Auswertung[[#This Row],[Platz]]=2,CONCATENATE(Tabelle_Auswertung[[#This Row],[Bildname]],\" von \",Tabelle_Auswertung[[#This Row],[Autor(in)]]),\"\")","v":""},{"$f":"IF(Tabelle_Auswertung[[#This Row],[Platz]]=3,CONCATENATE(Tabelle_Auswertung[[#This Row],[Bildname]],\" von \",Tabelle_Auswertung[[#This Row],[Autor(in)]]),\"\")","v":""},{"$f":"IF(Tabelle_Auswertung[[#This Row],[Platz]]=4,CONCATENATE(Tabelle_Auswertung[[#This Row],[Bildname]],\" von \",Tabelle_Auswertung[[#This Row],[Autor(in)]]),\"\")","v":""},{"$f":"IF(Tabelle_Auswertung[[#This Row],[Platz]]=5,CONCATENATE(Tabelle_Auswertung[[#This Row],[Bildname]],\" von \",Tabelle_Auswertung[[#This Row],[Autor(in)]]),\"\")","v":""},{"$f":"IF(Tabelle_Auswertung[[#This Row],[Platz]]=6,CONCATENATE(Tabelle_Auswertung[[#This Row],[Bildname]],\" von \",Tabelle_Auswertung[[#This Row],[Autor(in)]]),\"\")","v":""},{"$f":"IF(Tabelle_Auswertung[[#This Row],[Platz]]=7,CONCATENATE(Tabelle_Auswertung[[#This Row],[Bildname]],\" von \",Tabelle_Auswertung[[#This Row],[Autor(in)]]),\"\")","v":""},{"$f":"IF(Tabelle_Auswertung[[#This Row],[Platz]]=8,CONCATENATE(Tabelle_Auswertung[[#This Row],[Bildname]],\" von \",Tabelle_Auswertung[[#This Row],[Autor(in)]]),\"\")","v":""},{"$f":"IF(Tabelle_Auswertung[[#This Row],[Platz]]=9,CONCATENATE(Tabelle_Auswertung[[#This Row],[Bildname]],\" von \",Tabelle_Auswertung[[#This Row],[Autor(in)]]),\"\")","v":""},{"$f":"IF(Tabelle_Auswertung[[#This Row],[Platz]]=10,CONCATENATE(Tabelle_Auswertung[[#This Row],[Bildname]],\" von \",Tabelle_Auswertung[[#This Row],[Autor(in)]]),\"\")","v":"Tropfen.JPG von Susanne Deinhardt"}]
[11,"IMG_1103.JPG",8,9,7,8,10,8,6,8,{"$nulls":12},{"$f":"IF(Tabelle_Auswertung[[#This Row],[Bildname]]<>\"\",\n    IF(Tabelle_Auswertung[[#This Row],[abwesend]]=\"ja\",\n        SUM(Tabelle_Auswertung[[#This Row],[Juror 1]:[Juror 20]])/COUNT(Tabelle_Auswertung[[#This Row],[Juror 1]:[Juror 20]])*(COUNT(Tabelle_Auswertung[[#This Row],[Juror 1]:[Juror 20]])-1),\n        SUM(Tabelle_Auswertung[[#This Row],[Juror 1]:[Juror 20]])\n    ),\n\" - \")","v":56},{"$f":"IF(Tabelle_Auswertung[[#This Row],[Bildname]]<>\"\",IF(Tabelle_Auswertung[[#This Row],[Punkte]]>0,AVERAGE(Tabelle_Auswertung[[#This Row],[Juror 1]:[Juror 20]]),\" - \"),\" - \")","v":8},{"$f":"IF(Tabelle_Auswertung[[#This Row],[Bildname]]<>\"\",IF(Tabelle_Auswertung[[#This Row],[Punkte]]>0,RANK(Tabelle_Auswertung[[#This Row],[Punkte]],[Punkte],0),\" - \"),\" - \")","v":11},"Andreas Toltz","ja",{"$f":"IF(Tabelle_Auswertung[[#This Row],[Platz]]=1,CONCATENATE(Tabelle_Auswertung[[#This Row],[Bildname]],\" von \",Tabelle_Auswertung[[#This Row],[Autor(in)]]),\"\")","v":""},{"$f":"IF(Tabelle_Auswertung[[#This Row],[Platz]]=2,CONCATENATE(Tabelle_Auswertung[[#This Row],[Bildname]],\" von \",Tabelle_Auswertung[[#This Row],[Autor(in)]]),\"\")","v":""},{"$f":"IF(Tabelle_Auswertung[[#This Row],[Platz]]=3,CONCATENATE(Tabelle_Auswertung[[#This Row],[Bildname]],\" von \",Tabelle_Auswertung[[#This Row],[Autor(in)]]),\"\")","v":""},{"$f":"IF(Tabelle_Auswertung[[#This Row],[Platz]]=4,CONCATENATE(Tabelle_Auswertung[[#This Row],[Bildname]],\" von \",Tabelle_Auswertung[[#This Row],[Autor(in)]]),\"\")","v":""},{"$f":"IF(Tabelle_Auswertung[[#This Row],[Platz]]=5,CONCATENATE(Tabelle_Auswertung[[#This Row],[Bildname]],\" von \",Tabelle_Auswertung[[#This Row],[Autor(in)]]),\"\")","v":""},{"$f":"IF(Tabelle_Auswertung[[#This Row],[Platz]]=6,CONCATENATE(Tabelle_Auswertung[[#This Row],[Bildname]],\" von \",Tabelle_Auswertung[[#This Row],[Autor(in)]]),\"\")","v":""},{"$f":"IF(Tabelle_Auswertung[[#This Row],[Platz]]=7,CONCATENATE(Tabelle_Auswertung[[#This Row],[Bildname]],\" von \",Tabelle_Auswertung[[#This Row],[Autor(in)]]),\"\")","v":""},{"$f":"IF(Tabelle_Auswertung[[#This Row],[Platz]]=8,CONCATENATE(Tabelle_Auswertung[[#This Row],[Bildname]],\" von \",Tabelle_Auswertung[[#This Row],[Autor(in)]]),\"\")","v":""},{"$f":"IF(Tabelle_Auswertung[[#This Row],[Platz]]=9,CONCATENATE(Tabelle_Auswertung[[#This Row],[Bildname]],\" von \",Tabelle_Auswertung[[#This Row],[Autor(in)]]),\"\")","v":""},{"$f":"IF(Tabelle_Auswertung[[#This Row],[Platz]]=10,CONCATENATE(Tabelle_Auswertung[[#This Row],[Bildname]],\" von \",Tabelle_Auswertung[[#This Row],[Autor(in)]]),\"\")","v":""}]
[12,"moonlight.jpg",8,9,7,9,8,8,7,0,{"$nulls":12},{"$f":"IF(Tabelle_Auswertung[[#This Row],[Bildname]]<>\"\",\n    IF(Tabelle_Auswertung[[#This Row],[abwesend]]=\"ja\",\n        SUM(Tabelle_Auswertung[[#This Row],[Juror 1]:[Juror 20]])/COUNT(Tabelle_Auswertung[[#This Row],[Juror 1]:[Juror 20]])*(COUNT(Tabelle_Auswertung[[#This Row],[Juror 1]:[Juror 20]])-1),\n        SUM(Tabelle_Auswertung[[#This Row],[Juror 1]:[Juror 20]])\n    ),\n\" - \")","v":56},{"$f":"IF(Tabelle_Auswertung[[#This Row],[Bildname]]<>\"\",IF(Tabelle_Auswertung[[#This Row],[Punkte]]>0,AVERAGE(Tabelle_Auswertung[[#This Row],[Juror 1]:[Juror 20]]),\" - \"),\" - \")","v":{"v":7,"d":"7.00 "}},{"$f":"IF(Tabelle_Auswertung[[#This Row],[Bildname]]<>\"\",IF(Tabelle_Auswertung[[#This Row],[Punkte]]>0,RANK(Tabelle_Auswertung[[#This Row],[Punkte]],[Punkte],0),\" - \"),\" - \")","v":11},"Gerhard Rieß",null,{"$f":"IF(Tabelle_Auswertung[[#This Row],[Platz]]=1,CONCATENATE(Tabelle_Auswertung[[#This Row],[Bildname]],\" von \",Tabelle_Auswertung[[#This Row],[Autor(in)]]),\"\")","v":""},{"$f":"IF(Tabelle_Auswertung[[#This Row],[Platz]]=2,CONCATENATE(Tabelle_Auswertung[[#This Row],[Bildname]],\" von \",Tabelle_Auswertung[[#This Row],[Autor(in)]]),\"\")","v":""},{"$f":"IF(Tabelle_Auswertung[[#This Row],[Platz]]=3,CONCATENATE(Tabelle_Auswertung[[#This Row],[Bildname]],\" von \",Tabelle_Auswertung[[#This Row],[Autor(in)]]),\"\")","v":""},{"$f":"IF(Tabelle_Auswertung[[#This Row],[Platz]]=4,CONCATENATE(Tabelle_Auswertung[[#This Row],[Bildname]],\" von \",Tabelle_Auswertung[[#This Row],[Autor(in)]]),\"\")","v":""},{"$f":"IF(Tabelle_Auswertung[[#This Row],[Platz]]=5,CONCATENATE(Tabelle_Auswertung[[#This Row],[Bildname]],\" von \",Tabelle_Auswertung[[#This Row],[Autor(in)]]),\"\")","v":""},{"$f":"IF(Tabelle_Auswertung[[#This Row],[Platz]]=6,CONCATENATE(Tabelle_Auswertung[[#This Row],[Bildname]],\" von \",Tabelle_Auswertung[[#This Row],[Autor(in)]]),\"\")","v":""},{"$f":"IF(Tabelle_Auswertung[[#This Row],[Platz]]=7,CONCATENATE(Tabelle_Auswertung[[#This Row],[Bildname]],\" von \",Tabelle_Auswertung[[#This Row],[Autor(in)]]),\"\")","v":""},{"$f":"IF(Tabelle_Auswertung[[#This Row],[Platz]]=8,CONCATENATE(Tabelle_Auswertung[[#This Row],[Bildname]],\" von \",Tabelle_Auswertung[[#This Row],[Autor(in)]]),\"\")","v":""},{"$f":"IF(Tabelle_Auswertung[[#This Row],[Platz]]=9,CONCATENATE(Tabelle_Auswertung[[#This Row],[Bildname]],\" von \",Tabelle_Auswertung[[#This Row],[Autor(in)]]),\"\")","v":""},{"$f":"IF(Tabelle_Auswertung[[#This Row],[Platz]]=10,CONCATENATE(Tabelle_Auswertung[[#This Row],[Bildname]],\" von \",Tabelle_Auswertung[[#This Row],[Autor(in)]]),\"\")","v":""}]
[13,"Schnecke.JPG",8,0,6,9,10,9,7,7,{"$nulls":12},{"$f":"IF(Tabelle_Auswertung[[#This Row],[Bildname]]<>\"\",\n    IF(Tabelle_Auswertung[[#This Row],[abwesend]]=\"ja\",\n        SUM(Tabelle_Auswertung[[#This Row],[Juror 1]:[Juror 20]])/COUNT(Tabelle_Auswertung[[#This Row],[Juror 1]:[Juror 20]])*(COUNT(Tabelle_Auswertung[[#This Row],[Juror 1]:[Juror 20]])-1),\n        SUM(Tabelle_Auswertung[[#This Row],[Juror 1]:[Juror 20]])\n    ),\n\" - \")","v":56},{"$f":"IF(Tabelle_Auswertung[[#This Row],[Bildname]]<>\"\",IF(Tabelle_Auswertung[[#This Row],[Punkte]]>0,AVERAGE(Tabelle_Auswertung[[#This Row],[Juror 1]:[Juror 20]]),\" - \"),\" - \")","v":{"v":7,"d":"7.00 "}},{"$f":"IF(Tabelle_Auswertung[[#This Row],[Bildname]]<>\"\",IF(Tabelle_Auswertung[[#This Row],[Punkte]]>0,RANK(Tabelle_Auswertung[[#This Row],[Punkte]],[Punkte],0),\" - \"),\" - \")","v":11},"Nadja Cassim",null,{"$f":"IF(Tabelle_Auswertung[[#This Row],[Platz]]=1,CONCATENATE(Tabelle_Auswertung[[#This Row],[Bildname]],\" von \",Tabelle_Auswertung[[#This Row],[Autor(in)]]),\"\")","v":""},{"$f":"IF(Tabelle_Auswertung[[#This Row],[Platz]]=2,CONCATENATE(Tabelle_Auswertung[[#This Row],[Bildname]],\" von \",Tabelle_Auswertung[[#This Row],[Autor(in)]]),\"\")","v":""},{"$f":"IF(Tabelle_Auswertung[[#This Row],[Platz]]=3,CONCATENATE(Tabelle_Auswertung[[#This Row],[Bildname]],\" von \",Tabelle_Auswertung[[#This Row],[Autor(in)]]),\"\")","v":""},{"$f":"IF(Tabelle_Auswertung[[#This Row],[Platz]]=4,CONCATENATE(Tabelle_Auswertung[[#This Row],[Bildname]],\" von \",Tabelle_Auswertung[[#This Row],[Autor(in)]]),\"\")","v":""},{"$f":"IF(Tabelle_Auswertung[[#This Row],[Platz]]=5,CONCATENATE(Tabelle_Auswertung[[#This Row],[Bildname]],\" von \",Tabelle_Auswertung[[#This Row],[Autor(in)]]),\"\")","v":""},{"$f":"IF(Tabelle_Auswertung[[#This Row],[Platz]]=6,CONCATENATE(Tabelle_Auswertung[[#This Row],[Bildname]],\" von \",Tabelle_Auswertung[[#This Row],[Autor(in)]]),\"\")","v":""},{"$f":"IF(Tabelle_Auswertung[[#This Row],[Platz]]=7,CONCATENATE(Tabelle_Auswertung[[#This Row],[Bildname]],\" von \",Tabelle_Auswertung[[#This Row],[Autor(in)]]),\"\")","v":""},{"$f":"IF(Tabelle_Auswertung[[#This Row],[Platz]]=8,CONCATENATE(Tabelle_Auswertung[[#This Row],[Bildname]],\" von \",Tabelle_Auswertung[[#This Row],[Autor(in)]]),\"\")","v":""},{"$f":"IF(Tabelle_Auswertung[[#This Row],[Platz]]=9,CONCATENATE(Tabelle_Auswertung[[#This Row],[Bildname]],\" von \",Tabelle_Auswertung[[#This Row],[Autor(in)]]),\"\")","v":""},{"$f":"IF(Tabelle_Auswertung[[#This Row],[Platz]]=10,CONCATENATE(Tabelle_Auswertung[[#This Row],[Bildname]],\" von \",Tabelle_Auswertung[[#This Row],[Autor(in)]]),\"\")","v":""}]
[14,"Katholische Hofkirche.jpg",9,8,7,0,7,10,5,8,{"$nulls":12},{"$f":"IF(Tabelle_Auswertung[[#This Row],[Bildname]]<>\"\",\n    IF(Tabelle_Auswertung[[#This Row],[abwesend]]=\"ja\",\n        SUM(Tabelle_Auswertung[[#This Row],[Juror 1]:[Juror 20]])/COUNT(Tabelle_Auswertung[[#This Row],[Juror 1]:[Juror 20]])*(COUNT(Tabelle_Auswertung[[#This Row],[Juror 1]:[Juror 20]])-1),\n        SUM(Tabelle_Auswertung[[#This Row],[Juror 1]:[Juror 20]])\n    ),\n\" - \")","v":54},{"$f":"IF(Tabelle_Auswertung[[#This Row],[Bildname]]<>\"\",IF(Tabelle_Auswertung[[#This Row],[Punkte]]>0,AVERAGE(Tabelle_Auswertung[[#This Row],[Juror 1]:[Juror 20]]),\" - \"),\" - \")","v":{"v":6.75,"d":"6.75 "}},{"$f":"IF(Tabelle_Auswertung[[#This Row],[Bildname]]<>\"\",IF(Tabelle_Auswertung[[#This Row],[Punkte]]>0,RANK(Tabelle_Auswertung[[#This Row],[Punkte]],[Punkte],0),\" - \"),\" - \")","v":14},"Chris Finsterer",null,{"$f":"IF(Tabelle_Auswertung[[#This Row],[Platz]]=1,CONCATENATE(Tabelle_Auswertung[[#This Row],[Bildname]],\" von \",Tabelle_Auswertung[[#This Row],[Autor(in)]]),\"\")","v":""},{"$f":"IF(Tabelle_Auswertung[[#This Row],[Platz]]=2,CONCATENATE(Tabelle_Auswertung[[#This Row],[Bildname]],\" von \",Tabelle_Auswertung[[#This Row],[Autor(in)]]),\"\")","v":""},{"$f":"IF(Tabelle_Auswertung[[#This Row],[Platz]]=3,CONCATENATE(Tabelle_Auswertung[[#This Row],[Bildname]],\" von \",Tabelle_Auswertung[[#This Row],[Autor(in)]]),\"\")","v":""},{"$f":"IF(Tabelle_Auswertung[[#This Row],[Platz]]=4,CONCATENATE(Tabelle_Auswertung[[#This Row],[Bildname]],\" von \",Tabelle_Auswertung[[#This Row],[Autor(in)]]),\"\")","v":""},{"$f":"IF(Tabelle_Auswertung[[#This Row],[Platz]]=5,CONCATENATE(Tabelle_Auswertung[[#This Row],[Bildname]],\" von \",Tabelle_Auswertung[[#This Row],[Autor(in)]]),\"\")","v":""},{"$f":"IF(Tabelle_Auswertung[[#This Row],[Platz]]=6,CONCATENATE(Tabelle_Auswertung[[#This Row],[Bildname]],\" von \",Tabelle_Auswertung[[#This Row],[Autor(in)]]),\"\")","v":""},{"$f":"IF(Tabelle_Auswertung[[#This Row],[Platz]]=7,CONCATENATE(Tabelle_Auswertung[[#This Row],[Bildname]],\" von \",Tabelle_Auswertung[[#This Row],[Autor(in)]]),\"\")","v":""},{"$f":"IF(Tabelle_Auswertung[[#This Row],[Platz]]=8,CONCATENATE(Tabelle_Auswertung[[#This Row],[Bildname]],\" von \",Tabelle_Auswertung[[#This Row],[Autor(in)]]),\"\")","v":""},{"$f":"IF(Tabelle_Auswertung[[#This Row],[Platz]]=9,CONCATENATE(Tabelle_Auswertung[[#This Row],[Bildname]],\" von \",Tabelle_Auswertung[[#This Row],[Autor(in)]]),\"\")","v":""},{"$f":"IF(Tabelle_Auswertung[[#This Row],[Platz]]=10,CONCATENATE(Tabelle_Auswertung[[#This Row],[Bildname]],\" von \",Tabelle_Auswertung[[#This Row],[Autor(in)]]),\"\")","v":""}]
[15,"über_den_Wolken-1.jpg",7,10,8,8,8,7,0,6,{"$nulls":12},{"$f":"IF(Tabelle_Auswertung[[#This Row],[Bildname]]<>\"\",\n    IF(Tabelle_Auswertung[[#This Row],[abwesend]]=\"ja\",\n        SUM(Tabelle_Auswertung[[#This Row],[Juror 1]:[Juror 20]])/COUNT(Tabelle_Auswertung[[#This Row],[Juror 1]:[Juror 20]])*(COUNT(Tabelle_Auswertung[[#This Row],[Juror 1]:[Juror 20]])-1),\n        SUM(Tabelle_Auswertung[[#This Row],[Juror 1]:[Juror 20]])\n    ),\n\" - \")","v":54},{"$f":"IF(Tabelle_Auswertung[[#This Row],[Bildname]]<>\"\",IF(Tabelle_Auswertung[[#This Row],[Punkte]]>0,AVERAGE(Tabelle_Auswertung[[#This Row],[Juror 1]:[Juror 20]]),\" - \"),\" - \")","v":{"v":6.75,"d":"6.75 "}},{"$f":"IF(Tabelle_Auswertung[[#This Row],[Bildname]]<>\"\",IF(Tabelle_Auswertung[[#This Row],[Punkte]]>0,RANK(Tabelle_Auswertung[[#This Row],[Punkte]],[Punkte],0),\" - \"),\" - \")","v":14},"Oliver von Guérard",null,{"$f":"IF(Tabelle_Auswertung[[#This Row],[Platz]]=1,CONCATENATE(Tabelle_Auswertung[[#This Row],[Bildname]],\" von \",Tabelle_Auswertung[[#This Row],[Autor(in)]]),\"\")","v":""},{"$f":"IF(Tabelle_Auswertung[[#This Row],[Platz]]=2,CONCATENATE(Tabelle_Auswertung[[#This Row],[Bildname]],\" von \",Tabelle_Auswertung[[#This Row],[Autor(in)]]),\"\")","v":""},{"$f":"IF(Tabelle_Auswertung[[#This Row],[Platz]]=3,CONCATENATE(Tabelle_Auswertung[[#This Row],[Bildname]],\" von \",Tabelle_Auswertung[[#This Row],[Autor(in)]]),\"\")","v":""},{"$f":"IF(Tabelle_Auswertung[[#This Row],[Platz]]=4,CONCATENATE(Tabelle_Auswertung[[#This Row],[Bildname]],\" von \",Tabelle_Auswertung[[#This Row],[Autor(in)]]),\"\")","v":""},{"$f":"IF(Tabelle_Auswertung[[#This Row],[Platz]]=5,CONCATENATE(Tabelle_Auswertung[[#This Row],[Bildname]],\" von \",Tabelle_Auswertung[[#This Row],[Autor(in)]]),\"\")","v":""},{"$f":"IF(Tabelle_Auswertung[[#This Row],[Platz]]=6,CONCATENATE(Tabelle_Auswertung[[#This Row],[Bildname]],\" von \",Tabelle_Auswertung[[#This Row],[Autor(in)]]),\"\")","v":""},{"$f":"IF(Tabelle_Auswertung[[#This Row],[Platz]]=7,CONCATENATE(Tabelle_Auswertung[[#This Row],[Bildname]],\" von \",Tabelle_Auswertung[[#This Row],[Autor(in)]]),\"\")","v":""},{"$f":"IF(Tabelle_Auswertung[[#This Row],[Platz]]=8,CONCATENATE(Tabelle_Auswertung[[#This Row],[Bildname]],\" von \",Tabelle_Auswertung[[#This Row],[Autor(in)]]),\"\")","v":""},{"$f":"IF(Tabelle_Auswertung[[#This Row],[Platz]]=9,CONCATENATE(Tabelle_Auswertung[[#This Row],[Bildname]],\" von \",Tabelle_Auswertung[[#This Row],[Autor(in)]]),\"\")","v":""},{"$f":"IF(Tabelle_Auswertung[[#This Row],[Platz]]=10,CONCATENATE(Tabelle_Auswertung[[#This Row],[Bildname]],\" von \",Tabelle_Auswertung[[#This Row],[Autor(in)]]),\"\")","v":""}]
[16,"über_den_Wolken-3.jpg",8,9,6,9,8,7,0,7,{"$nulls":12},{"$f":"IF(Tabelle_Auswertung[[#This Row],[Bildname]]<>\"\",\n    IF(Tabelle_Auswertung[[#This Row],[abwesend]]=\"ja\",\n        SUM(Tabelle_Auswertung[[#This Row],[Juror 1]:[Juror 20]])/COUNT(Tabelle_Auswertung[[#This Row],[Juror 1]:[Juror 20]])*(COUNT(Tabelle_Auswertung[[#This Row],[Juror 1]:[Juror 20]])-1),\n        SUM(Tabelle_Auswertung[[#This Row],[Juror 1]:[Juror 20]])\n    ),\n\" - \")","v":54},{"$f":"IF(Tabelle_Auswertung[[#This Row],[Bildname]]<>\"\",IF(Tabelle_Auswertung[[#This Row],[Punkte]]>0,AVERAGE(Tabelle_Auswertung[[#This Row],[Juror 1]:[Juror 20]]),\" - \"),\" - \")","v":{"v":6.75,"d":"6.75 "}},{"$f":"IF(Tabelle_Auswertung[[#This Row],[Bildname]]<>\"\",IF(Tabelle_Auswertung[[#This Row],[Punkte]]>0,RANK(Tabelle_Auswertung[[#This Row],[Punkte]],[Punkte],0),\" - \"),\" - \")","v":14},"Oliver von Guérard",null,{"$f":"IF(Tabelle_Auswertung[[#This Row],[Platz]]=1,CONCATENATE(Tabelle_Auswertung[[#This Row],[Bildname]],\" von \",Tabelle_Auswertung[[#This Row],[Autor(in)]]),\"\")","v":""},{"$f":"IF(Tabelle_Auswertung[[#This Row],[Platz]]=2,CONCATENATE(Tabelle_Auswertung[[#This Row],[Bildname]],\" von \",Tabelle_Auswertung[[#This Row],[Autor(in)]]),\"\")","v":""},{"$f":"IF(Tabelle_Auswertung[[#This Row],[Platz]]=3,CONCATENATE(Tabelle_Auswertung[[#This Row],[Bildname]],\" von \",Tabelle_Auswertung[[#This Row],[Autor(in)]]),\"\")","v":""},{"$f":"IF(Tabelle_Auswertung[[#This Row],[Platz]]=4,CONCATENATE(Tabelle_Auswertung[[#This Row],[Bildname]],\" von \",Tabelle_Auswertung[[#This Row],[Autor(in)]]),\"\")","v":""},{"$f":"IF(Tabelle_Auswertung[[#This Row],[Platz]]=5,CONCATENATE(Tabelle_Auswertung[[#This Row],[Bildname]],\" von \",Tabelle_Auswertung[[#This Row],[Autor(in)]]),\"\")","v":""},{"$f":"IF(Tabelle_Auswertung[[#This Row],[Platz]]=6,CONCATENATE(Tabelle_Auswertung[[#This Row],[Bildname]],\" von \",Tabelle_Auswertung[[#This Row],[Autor(in)]]),\"\")","v":""},{"$f":"IF(Tabelle_Auswertung[[#This Row],[Platz]]=7,CONCATENATE(Tabelle_Auswertung[[#This Row],[Bildname]],\" von \",Tabelle_Auswertung[[#This Row],[Autor(in)]]),\"\")","v":""},{"$f":"IF(Tabelle_Auswertung[[#This Row],[Platz]]=8,CONCATENATE(Tabelle_Auswertung[[#This Row],[Bildname]],\" von \",Tabelle_Auswertung[[#This Row],[Autor(in)]]),\"\")","v":""},{"$f":"IF(Tabelle_Auswertung[[#This Row],[Platz]]=9,CONCATENATE(Tabelle_Auswertung[[#This Row],[Bildname]],\" von \",Tabelle_Auswertung[[#This Row],[Autor(in)]]),\"\")","v":""},{"$f":"IF(Tabelle_Auswertung[[#This Row],[Platz]]=10,CONCATENATE(Tabelle_Auswertung[[#This Row],[Bildname]],\" von \",Tabelle_Auswertung[[#This Row],[Autor(in)]]),\"\")","v":""}]
[17,"Sozialgericht.jpg",6,8,8,9,9,0,6,6,{"$nulls":12},{"$f":"IF(Tabelle_Auswertung[[#This Row],[Bildname]]<>\"\",\n    IF(Tabelle_Auswertung[[#This Row],[abwesend]]=\"ja\",\n        SUM(Tabelle_Auswertung[[#This Row],[Juror 1]:[Juror 20]])/COUNT(Tabelle_Auswertung[[#This Row],[Juror 1]:[Juror 20]])*(COUNT(Tabelle_Auswertung[[#This Row],[Juror 1]:[Juror 20]])-1),\n        SUM(Tabelle_Auswertung[[#This Row],[Juror 1]:[Juror 20]])\n    ),\n\" - \")","v":52},{"$f":"IF(Tabelle_Auswertung[[#This Row],[Bildname]]<>\"\",IF(Tabelle_Auswertung[[#This Row],[Punkte]]>0,AVERAGE(Tabelle_Auswertung[[#This Row],[Juror 1]:[Juror 20]]),\" - \"),\" - \")","v":6.5},{"$f":"IF(Tabelle_Auswertung[[#This Row],[Bildname]]<>\"\",IF(Tabelle_Auswertung[[#This Row],[Punkte]]>0,RANK(Tabelle_Auswertung[[#This Row],[Punkte]],[Punkte],0),\" - \"),\" - \")","v":17},"Antje Finsterer",null,{"$f":"IF(Tabelle_Auswertung[[#This Row],[Platz]]=1,CONCATENATE(Tabelle_Auswertung[[#This Row],[Bildname]],\" von \",Tabelle_Auswertung[[#This Row],[Autor(in)]]),\"\")","v":""},{"$f":"IF(Tabelle_Auswertung[[#This Row],[Platz]]=2,CONCATENATE(Tabelle_Auswertung[[#This Row],[Bildname]],\" von \",Tabelle_Auswertung[[#This Row],[Autor(in)]]),\"\")","v":""},{"$f":"IF(Tabelle_Auswertung[[#This Row],[Platz]]=3,CONCATENATE(Tabelle_Auswertung[[#This Row],[Bildname]],\" von \",Tabelle_Auswertung[[#This Row],[Autor(in)]]),\"\")","v":""},{"$f":"IF(Tabelle_Auswertung[[#This Row],[Platz]]=4,CONCATENATE(Tabelle_Auswertung[[#This Row],[Bildname]],\" von \",Tabelle_Auswertung[[#This Row],[Autor(in)]]),\"\")","v":""},{"$f":"IF(Tabelle_Auswertung[[#This Row],[Platz]]=5,CONCATENATE(Tabelle_Auswertung[[#This Row],[Bildname]],\" von \",Tabelle_Auswertung[[#This Row],[Autor(in)]]),\"\")","v":""},{"$f":"IF(Tabelle_Auswertung[[#This Row],[Platz]]=6,CONCATENATE(Tabelle_Auswertung[[#This Row],[Bildname]],\" von \",Tabelle_Auswertung[[#This Row],[Autor(in)]]),\"\")","v":""},{"$f":"IF(Tabelle_Auswertung[[#This Row],[Platz]]=7,CONCATENATE(Tabelle_Auswertung[[#This Row],[Bildname]],\" von \",Tabelle_Auswertung[[#This Row],[Autor(in)]]),\"\")","v":""},{"$f":"IF(Tabelle_Auswertung[[#This Row],[Platz]]=8,CONCATENATE(Tabelle_Auswertung[[#This Row],[Bildname]],\" von \",Tabelle_Auswertung[[#This Row],[Autor(in)]]),\"\")","v":""},{"$f":"IF(Tabelle_Auswertung[[#This Row],[Platz]]=9,CONCATENATE(Tabelle_Auswertung[[#This Row],[Bildname]],\" von \",Tabelle_Auswertung[[#This Row],[Autor(in)]]),\"\")","v":""},{"$f":"IF(Tabelle_Auswertung[[#This Row],[Platz]]=10,CONCATENATE(Tabelle_Auswertung[[#This Row],[Bildname]],\" von \",Tabelle_Auswertung[[#This Row],[Autor(in)]]),\"\")","v":""}]
[18,"Szenen einer Ehe.jpg",7,8,8,0,9,10,6,4,{"$nulls":12},{"$f":"IF(Tabelle_Auswertung[[#This Row],[Bildname]]<>\"\",\n    IF(Tabelle_Auswertung[[#This Row],[abwesend]]=\"ja\",\n        SUM(Tabelle_Auswertung[[#This Row],[Juror 1]:[Juror 20]])/COUNT(Tabelle_Auswertung[[#This Row],[Juror 1]:[Juror 20]])*(COUNT(Tabelle_Auswertung[[#This Row],[Juror 1]:[Juror 20]])-1),\n        SUM(Tabelle_Auswertung[[#This Row],[Juror 1]:[Juror 20]])\n    ),\n\" - \")","v":52},{"$f":"IF(Tabelle_Auswertung[[#This Row],[Bildname]]<>\"\",IF(Tabelle_Auswertung[[#This Row],[Punkte]]>0,AVERAGE(Tabelle_Auswertung[[#This Row],[Juror 1]:[Juror 20]]),\" - \"),\" - \")","v":6.5},{"$f":"IF(Tabelle_Auswertung[[#This Row],[Bildname]]<>\"\",IF(Tabelle_Auswertung[[#This Row],[Punkte]]>0,RANK(Tabelle_Auswertung[[#This Row],[Punkte]],[Punkte],0),\" - \"),\" - \")","v":17},"Chris Finsterer",null,{"$f":"IF(Tabelle_Auswertung[[#This Row],[Platz]]=1,CONCATENATE(Tabelle_Auswertung[[#This Row],[Bildname]],\" von \",Tabelle_Auswertung[[#This Row],[Autor(in)]]),\"\")","v":""},{"$f":"IF(Tabelle_Auswertung[[#This Row],[Platz]]=2,CONCATENATE(Tabelle_Auswertung[[#This Row],[Bildname]],\" von \",Tabelle_Auswertung[[#This Row],[Autor(in)]]),\"\")","v":""},{"$f":"IF(Tabelle_Auswertung[[#This Row],[Platz]]=3,CONCATENATE(Tabelle_Auswertung[[#This Row],[Bildname]],\" von \",Tabelle_Auswertung[[#This Row],[Autor(in)]]),\"\")","v":""},{"$f":"IF(Tabelle_Auswertung[[#This Row],[Platz]]=4,CONCATENATE(Tabelle_Auswertung[[#This Row],[Bildname]],\" von \",Tabelle_Auswertung[[#This Row],[Autor(in)]]),\"\")","v":""},{"$f":"IF(Tabelle_Auswertung[[#This Row],[Platz]]=5,CONCATENATE(Tabelle_Auswertung[[#This Row],[Bildname]],\" von \",Tabelle_Auswertung[[#This Row],[Autor(in)]]),\"\")","v":""},{"$f":"IF(Tabelle_Auswertung[[#This Row],[Platz]]=6,CONCATENATE(Tabelle_Auswertung[[#This Row],[Bildname]],\" von \",Tabelle_Auswertung[[#This Row],[Autor(in)]]),\"\")","v":""},{"$f":"IF(Tabelle_Auswertung[[#This Row],[Platz]]=7,CONCATENATE(Tabelle_Auswertung[[#This Row],[Bildname]],\" von \",Tabelle_Auswertung[[#This Row],[Autor(in)]]),\"\")","v":""},{"$f":"IF(Tabelle_Auswertung[[#This Row],[Platz]]=8,CONCATENATE(Tabelle_Auswertung[[#This Row],[Bildname]],\" von \",Tabelle_Auswertung[[#This Row],[Autor(in)]]),\"\")","v":""},{"$f":"IF(Tabelle_Auswertung[[#This Row],[Platz]]=9,CONCATENATE(Tabelle_Auswertung[[#This Row],[Bildname]],\" von \",Tabelle_Auswertung[[#This Row],[Autor(in)]]),\"\")","v":""},{"$f":"IF(Tabelle_Auswertung[[#This Row],[Platz]]=10,CONCATENATE(Tabelle_Auswertung[[#This Row],[Bildname]],\" von \",Tabelle_Auswertung[[#This Row],[Autor(in)]]),\"\")","v":""}]
[19,"Vollmondnacht.jpg",8,10,6,0,7,8,6,7,{"$nulls":12},{"$f":"IF(Tabelle_Auswertung[[#This Row],[Bildname]]<>\"\",\n    IF(Tabelle_Auswertung[[#This Row],[abwesend]]=\"ja\",\n        SUM(Tabelle_Auswertung[[#This Row],[Juror 1]:[Juror 20]])/COUNT(Tabelle_Auswertung[[#This Row],[Juror 1]:[Juror 20]])*(COUNT(Tabelle_Auswertung[[#This Row],[Juror 1]:[Juror 20]])-1),\n        SUM(Tabelle_Auswertung[[#This Row],[Juror 1]:[Juror 20]])\n    ),\n\" - \")","v":52},{"$f":"IF(Tabelle_Auswertung[[#This Row],[Bildname]]<>\"\",IF(Tabelle_Auswertung[[#This Row],[Punkte]]>0,AVERAGE(Tabelle_Auswertung[[#This Row],[Juror 1]:[Juror 20]]),\" - \"),\" - \")","v":{"v":6.5,"d":"6.50 "}},{"$f":"IF(Tabelle_Auswertung[[#This Row],[Bildname]]<>\"\",IF(Tabelle_Auswertung[[#This Row],[Punkte]]>0,RANK(Tabelle_Auswertung[[#This Row],[Punkte]],[Punkte],0),\" - \"),\" - \")","v":17},"Chris Finsterer",null,{"$f":"IF(Tabelle_Auswertung[[#This Row],[Platz]]=1,CONCATENATE(Tabelle_Auswertung[[#This Row],[Bildname]],\" von \",Tabelle_Auswertung[[#This Row],[Autor(in)]]),\"\")","v":""},{"$f":"IF(Tabelle_Auswertung[[#This Row],[Platz]]=2,CONCATENATE(Tabelle_Auswertung[[#This Row],[Bildname]],\" von \",Tabelle_Auswertung[[#This Row],[Autor(in)]]),\"\")","v":""},{"$f":"IF(Tabelle_Auswertung[[#This Row],[Platz]]=3,CONCATENATE(Tabelle_Auswertung[[#This Row],[Bildname]],\" von \",Tabelle_Auswertung[[#This Row],[Autor(in)]]),\"\")","v":""},{"$f":"IF(Tabelle_Auswertung[[#This Row],[Platz]]=4,CONCATENATE(Tabelle_Auswertung[[#This Row],[Bildname]],\" von \",Tabelle_Auswertung[[#This Row],[Autor(in)]]),\"\")","v":""},{"$f":"IF(Tabelle_Auswertung[[#This Row],[Platz]]=5,CONCATENATE(Tabelle_Auswertung[[#This Row],[Bildname]],\" von \",Tabelle_Auswertung[[#This Row],[Autor(in)]]),\"\")","v":""},{"$f":"IF(Tabelle_Auswertung[[#This Row],[Platz]]=6,CONCATENATE(Tabelle_Auswertung[[#This Row],[Bildname]],\" von \",Tabelle_Auswertung[[#This Row],[Autor(in)]]),\"\")","v":""},{"$f":"IF(Tabelle_Auswertung[[#This Row],[Platz]]=7,CONCATENATE(Tabelle_Auswertung[[#This Row],[Bildname]],\" von \",Tabelle_Auswertung[[#This Row],[Autor(in)]]),\"\")","v":""},{"$f":"IF(Tabelle_Auswertung[[#This Row],[Platz]]=8,CONCATENATE(Tabelle_Auswertung[[#This Row],[Bildname]],\" von \",Tabelle_Auswertung[[#This Row],[Autor(in)]]),\"\")","v":""},{"$f":"IF(Tabelle_Auswertung[[#This Row],[Platz]]=9,CONCATENATE(Tabelle_Auswertung[[#This Row],[Bildname]],\" von \",Tabelle_Auswertung[[#This Row],[Autor(in)]]),\"\")","v":""},{"$f":"IF(Tabelle_Auswertung[[#This Row],[Platz]]=10,CONCATENATE(Tabelle_Auswertung[[#This Row],[Bildname]],\" von \",Tabelle_Auswertung[[#This Row],[Autor(in)]]),\"\")","v":""}]
[20,"IMG_0869.JPG",5,8,7,8,9,6,8,8,{"$nulls":12},{"$f":"IF(Tabelle_Auswertung[[#This Row],[Bildname]]<>\"\",\n    IF(Tabelle_Auswertung[[#This Row],[abwesend]]=\"ja\",\n        SUM(Tabelle_Auswertung[[#This Row],[Juror 1]:[Juror 20]])/COUNT(Tabelle_Auswertung[[#This Row],[Juror 1]:[Juror 20]])*(COUNT(Tabelle_Auswertung[[#This Row],[Juror 1]:[Juror 20]])-1),\n        SUM(Tabelle_Auswertung[[#This Row],[Juror 1]:[Juror 20]])\n    ),\n\" - \")","v":51.625},{"$f":"IF(Tabelle_Auswertung[[#This Row],[Bildname]]<>\"\",IF(Tabelle_Auswertung[[#This Row],[Punkte]]>0,AVERAGE(Tabelle_Auswertung[[#This Row],[Juror 1]:[Juror 20]]),\" - \"),\" - \")","v":{"v":7.375,"d":"7.38 "}},{"$f":"IF(Tabelle_Auswertung[[#This Row],[Bildname]]<>\"\",IF(Tabelle_Auswertung[[#This Row],[Punkte]]>0,RANK(Tabelle_Auswertung[[#This Row],[Punkte]],[Punkte],0),\" - \"),\" - \")","v":20},"Andreas Toltz","ja",{"$f":"IF(Tabelle_Auswertung[[#This Row],[Platz]]=1,CONCATENATE(Tabelle_Auswertung[[#This Row],[Bildname]],\" von \",Tabelle_Auswertung[[#This Row],[Autor(in)]]),\"\")","v":""},{"$f":"IF(Tabelle_Auswertung[[#This Row],[Platz]]=2,CONCATENATE(Tabelle_Auswertung[[#This Row],[Bildname]],\" von \",Tabelle_Auswertung[[#This Row],[Autor(in)]]),\"\")","v":""},{"$f":"IF(Tabelle_Auswertung[[#This Row],[Platz]]=3,CONCATENATE(Tabelle_Auswertung[[#This Row],[Bildname]],\" von \",Tabelle_Auswertung[[#This Row],[Autor(in)]]),\"\")","v":""},{"$f":"IF(Tabelle_Auswertung[[#This Row],[Platz]]=4,CONCATENATE(Tabelle_Auswertung[[#This Row],[Bildname]],\" von \",Tabelle_Auswertung[[#This Row],[Autor(in)]]),\"\")","v":""},{"$f":"IF(Tabelle_Auswertung[[#This Row],[Platz]]=5,CONCATENATE(Tabelle_Auswertung[[#This Row],[Bildname]],\" von \",Tabelle_Auswertung[[#This Row],[Autor(in)]]),\"\")","v":""},{"$f":"IF(Tabelle_Auswertung[[#This Row],[Platz]]=6,CONCATENATE(Tabelle_Auswertung[[#This Row],[Bildname]],\" von \",Tabelle_Auswertung[[#This Row],[Autor(in)]]),\"\")","v":""},{"$f":"IF(Tabelle_Auswertung[[#This Row],[Platz]]=7,CONCATENATE(Tabelle_Auswertung[[#This Row],[Bildname]],\" von \",Tabelle_Auswertung[[#This Row],[Autor(in)]]),\"\")","v":""},{"$f":"IF(Tabelle_Auswertung[[#This Row],[Platz]]=8,CONCATENATE(Tabelle_Auswertung[[#This Row],[Bildname]],\" von \",Tabelle_Auswertung[[#This Row],[Autor(in)]]),\"\")","v":""},{"$f":"IF(Tabelle_Auswertung[[#This Row],[Platz]]=9,CONCATENATE(Tabelle_Auswertung[[#This Row],[Bildname]],\" von \",Tabelle_Auswertung[[#This Row],[Autor(in)]]),\"\")","v":""},{"$f":"IF(Tabelle_Auswertung[[#This Row],[Platz]]=10,CONCATENATE(Tabelle_Auswertung[[#This Row],[Bildname]],\" von \",Tabelle_Auswertung[[#This Row],[Autor(in)]]),\"\")","v":""}]
[21,"Kristalle-2.jpg",7,8,7,9,9,7,0,4,{"$nulls":12},{"$f":"IF(Tabelle_Auswertung[[#This Row],[Bildname]]<>\"\",\n    IF(Tabelle_Auswertung[[#This Row],[abwesend]]=\"ja\",\n        SUM(Tabelle_Auswertung[[#This Row],[Juror 1]:[Juror 20]])/COUNT(Tabelle_Auswertung[[#This Row],[Juror 1]:[Juror 20]])*(COUNT(Tabelle_Auswertung[[#This Row],[Juror 1]:[Juror 20]])-1),\n        SUM(Tabelle_Auswertung[[#This Row],[Juror 1]:[Juror 20]])\n    ),\n\" - \")","v":51},{"$f":"IF(Tabelle_Auswertung[[#This Row],[Bildname]]<>\"\",IF(Tabelle_Auswertung[[#This Row],[Punkte]]>0,AVERAGE(Tabelle_Auswertung[[#This Row],[Juror 1]:[Juror 20]]),\" - \"),\" - \")","v":{"v":6.375,"d":"6.38 "}},{"$f":"IF(Tabelle_Auswertung[[#This Row],[Bildname]]<>\"\",IF(Tabelle_Auswertung[[#This Row],[Punkte]]>0,RANK(Tabelle_Auswertung[[#This Row],[Punkte]],[Punkte],0),\" - \"),\" - \")","v":21},"Oliver von Guérard",null,{"$f":"IF(Tabelle_Auswertung[[#This Row],[Platz]]=1,CONCATENATE(Tabelle_Auswertung[[#This Row],[Bildname]],\" von \",Tabelle_Auswertung[[#This Row],[Autor(in)]]),\"\")","v":""},{"$f":"IF(Tabelle_Auswertung[[#This Row],[Platz]]=2,CONCATENATE(Tabelle_Auswertung[[#This Row],[Bildname]],\" von \",Tabelle_Auswertung[[#This Row],[Autor(in)]]),\"\")","v":""},{"$f":"IF(Tabelle_Auswertung[[#This Row],[Platz]]=3,CONCATENATE(Tabelle_Auswertung[[#This Row],[Bildname]],\" von \",Tabelle_Auswertung[[#This Row],[Autor(in)]]),\"\")","v":""},{"$f":"IF(Tabelle_Auswertung[[#This Row],[Platz]]=4,CONCATENATE(Tabelle_Auswertung[[#This Row],[Bildname]],\" von \",Tabelle_Auswertung[[#This Row],[Autor(in)]]),\"\")","v":""},{"$f":"IF(Tabelle_Auswertung[[#This Row],[Platz]]=5,CONCATENATE(Tabelle_Auswertung[[#This Row],[Bildname]],\" von \",Tabelle_Auswertung[[#This Row],[Autor(in)]]),\"\")","v":""},{"$f":"IF(Tabelle_Auswertung[[#This Row],[Platz]]=6,CONCATENATE(Tabelle_Auswertung[[#This Row],[Bildname]],\" von \",Tabelle_Auswertung[[#This Row],[Autor(in)]]),\"\")","v":""},{"$f":"IF(Tabelle_Auswertung[[#This Row],[Platz]]=7,CONCATENATE(Tabelle_Auswertung[[#This Row],[Bildname]],\" von \",Tabelle_Auswertung[[#This Row],[Autor(in)]]),\"\")","v":""},{"$f":"IF(Tabelle_Auswertung[[#This Row],[Platz]]=8,CONCATENATE(Tabelle_Auswertung[[#This Row],[Bildname]],\" von \",Tabelle_Auswertung[[#This Row],[Autor(in)]]),\"\")","v":""},{"$f":"IF(Tabelle_Auswertung[[#This Row],[Platz]]=9,CONCATENATE(Tabelle_Auswertung[[#This Row],[Bildname]],\" von \",Tabelle_Auswertung[[#This Row],[Autor(in)]]),\"\")","v":""},{"$f":"IF(Tabelle_Auswertung[[#This Row],[Platz]]=10,CONCATENATE(Tabelle_Auswertung[[#This Row],[Bildname]],\" von \",Tabelle_Auswertung[[#This Row],[Autor(in)]]),\"\")","v":""}]
[22,"Spritzig.JPG",7,10,0,7,8,6,6,7,{"$nulls":12},{"$f":"IF(Tabelle_Auswertung[[#This Row],[Bildname]]<>\"\",\n    IF(Tabelle_Auswertung[[#This Row],[abwesend]]=\"ja\",\n        SUM(Tabelle_Auswertung[[#This Row],[Juror 1]:[Juror 20]])/COUNT(Tabelle_Auswertung[[#This Row],[Juror 1]:[Juror 20]])*(COUNT(Tabelle_Auswertung[[#This Row],[Juror 1]:[Juror 20]])-1),\n        SUM(Tabelle_Auswertung[[#This Row],[Juror 1]:[Juror 20]])\n    ),\n\" - \")","v":51},{"$f":"IF(Tabelle_Auswertung[[#This Row],[Bildname]]<>\"\",IF(Tabelle_Auswertung[[#This Row],[Punkte]]>0,AVERAGE(Tabelle_Auswertung[[#This Row],[Juror 1]:[Juror 20]]),\" - \"),\" - \")","v":{"v":6.375,"d":"6.38 "}},{"$f":"IF(Tabelle_Auswertung[[#This Row],[Bildname]]<>\"\",IF(Tabelle_Auswertung[[#This Row],[Punkte]]>0,RANK(Tabelle_Auswertung[[#This Row],[Punkte]],[Punkte],0),\" - \"),\" - \")","v":21},"Albrecht Flierl",null,{"$f":"IF(Tabelle_Auswertung[[#This Row],[Platz]]=1,CONCATENATE(Tabelle_Auswertung[[#This Row],[Bildname]],\" von \",Tabelle_Auswertung[[#This Row],[Autor(in)]]),\"\")","v":""},{"$f":"IF(Tabelle_Auswertung[[#This Row],[Platz]]=2,CONCATENATE(Tabelle_Auswertung[[#This Row],[Bildname]],\" von \",Tabelle_Auswertung[[#This Row],[Autor(in)]]),\"\")","v":""},{"$f":"IF(Tabelle_Auswertung[[#This Row],[Platz]]=3,CONCATENATE(Tabelle_Auswertung[[#This Row],[Bildname]],\" von \",Tabelle_Auswertung[[#This Row],[Autor(in)]]),\"\")","v":""},{"$f":"IF(Tabelle_Auswertung[[#This Row],[Platz]]=4,CONCATENATE(Tabelle_Auswertung[[#This Row],[Bildname]],\" von \",Tabelle_Auswertung[[#This Row],[Autor(in)]]),\"\")","v":""},{"$f":"IF(Tabelle_Auswertung[[#This Row],[Platz]]=5,CONCATENATE(Tabelle_Auswertung[[#This Row],[Bildname]],\" von \",Tabelle_Auswertung[[#This Row],[Autor(in)]]),\"\")","v":""},{"$f":"IF(Tabelle_Auswertung[[#This Row],[Platz]]=6,CONCATENATE(Tabelle_Auswertung[[#This Row],[Bildname]],\" von \",Tabelle_Auswertung[[#This Row],[Autor(in)]]),\"\")","v":""},{"$f":"IF(Tabelle_Auswertung[[#This Row],[Platz]]=7,CONCATENATE(Tabelle_Auswertung[[#This Row],[Bildname]],\" von \",Tabelle_Auswertung[[#This Row],[Autor(in)]]),\"\")","v":""},{"$f":"IF(Tabelle_Auswertung[[#This Row],[Platz]]=8,CONCATENATE(Tabelle_Auswertung[[#This Row],[Bildname]],\" von \",Tabelle_Auswertung[[#This Row],[Autor(in)]]),\"\")","v":""},{"$f":"IF(Tabelle_Auswertung[[#This Row],[Platz]]=9,CONCATENATE(Tabelle_Auswertung[[#This Row],[Bildname]],\" von \",Tabelle_Auswertung[[#This Row],[Autor(in)]]),\"\")","v":""},{"$f":"IF(Tabelle_Auswertung[[#This Row],[Platz]]=10,CONCATENATE(Tabelle_Auswertung[[#This Row],[Bildname]],\" von \",Tabelle_Auswertung[[#This Row],[Autor(in)]]),\"\")","v":""}]
[23,"IMG_0837.JPG",8,7,6,8,9,4,8,8,{"$nulls":12},{"$f":"IF(Tabelle_Auswertung[[#This Row],[Bildname]]<>\"\",\n    IF(Tabelle_Auswertung[[#This Row],[abwesend]]=\"ja\",\n        SUM(Tabelle_Auswertung[[#This Row],[Juror 1]:[Juror 20]])/COUNT(Tabelle_Auswertung[[#This Row],[Juror 1]:[Juror 20]])*(COUNT(Tabelle_Auswertung[[#This Row],[Juror 1]:[Juror 20]])-1),\n        SUM(Tabelle_Auswertung[[#This Row],[Juror 1]:[Juror 20]])\n    ),\n\" - \")","v":50.75},{"$f":"IF(Tabelle_Auswertung[[#This Row],[Bildname]]<>\"\",IF(Tabelle_Auswertung[[#This Row],[Punkte]]>0,AVERAGE(Tabelle_Auswertung[[#This Row],[Juror 1]:[Juror 20]]),\" - \"),\" - \")","v":7.25},{"$f":"IF(Tabelle_Auswertung[[#This Row],[Bildname]]<>\"\",IF(Tabelle_Auswertung[[#This Row],[Punkte]]>0,RANK(Tabelle_Auswertung[[#This Row],[Punkte]],[Punkte],0),\" - \"),\" - \")","v":23},"Andreas Toltz","ja",{"$f":"IF(Tabelle_Auswertung[[#This Row],[Platz]]=1,CONCATENATE(Tabelle_Auswertung[[#This Row],[Bildname]],\" von \",Tabelle_Auswertung[[#This Row],[Autor(in)]]),\"\")","v":""},{"$f":"IF(Tabelle_Auswertung[[#This Row],[Platz]]=2,CONCATENATE(Tabelle_Auswertung[[#This Row],[Bildname]],\" von \",Tabelle_Auswertung[[#This Row],[Autor(in)]]),\"\")","v":""},{"$f":"IF(Tabelle_Auswertung[[#This Row],[Platz]]=3,CONCATENATE(Tabelle_Auswertung[[#This Row],[Bildname]],\" von \",Tabelle_Auswertung[[#This Row],[Autor(in)]]),\"\")","v":""},{"$f":"IF(Tabelle_Auswertung[[#This Row],[Platz]]=4,CONCATENATE(Tabelle_Auswertung[[#This Row],[Bildname]],\" von \",Tabelle_Auswertung[[#This Row],[Autor(in)]]),\"\")","v":""},{"$f":"IF(Tabelle_Auswertung[[#This Row],[Platz]]=5,CONCATENATE(Tabelle_Auswertung[[#This Row],[Bildname]],\" von \",Tabelle_Auswertung[[#This Row],[Autor(in)]]),\"\")","v":""},{"$f":"IF(Tabelle_Auswertung[[#This Row],[Platz]]=6,CONCATENATE(Tabelle_Auswertung[[#This Row],[Bildname]],\" von \",Tabelle_Auswertung[[#This Row],[Autor(in)]]),\"\")","v":""},{"$f":"IF(Tabelle_Auswertung[[#This Row],[Platz]]=7,CONCATENATE(Tabelle_Auswertung[[#This Row],[Bildname]],\" von \",Tabelle_Auswertung[[#This Row],[Autor(in)]]),\"\")","v":""},{"$f":"IF(Tabelle_Auswertung[[#This Row],[Platz]]=8,CONCATENATE(Tabelle_Auswertung[[#This Row],[Bildname]],\" von \",Tabelle_Auswertung[[#This Row],[Autor(in)]]),\"\")","v":""},{"$f":"IF(Tabelle_Auswertung[[#This Row],[Platz]]=9,CONCATENATE(Tabelle_Auswertung[[#This Row],[Bildname]],\" von \",Tabelle_Auswertung[[#This Row],[Autor(in)]]),\"\")","v":""},{"$f":"IF(Tabelle_Auswertung[[#This Row],[Platz]]=10,CONCATENATE(Tabelle_Auswertung[[#This Row],[Bildname]],\" von \",Tabelle_Auswertung[[#This Row],[Autor(in)]]),\"\")","v":""}]
[24,"Goldstimmung.jpg",7,8,7,0,8,8,6,6,{"$nulls":12},{"$f":"IF(Tabelle_Auswertung[[#This Row],[Bildname]]<>\"\",\n    IF(Tabelle_Auswertung[[#This Row],[abwesend]]=\"ja\",\n        SUM(Tabelle_Auswertung[[#This Row],[Juror 1]:[Juror 20]])/COUNT(Tabelle_Auswertung[[#This Row],[Juror 1]:[Juror 20]])*(COUNT(Tabelle_Auswertung[[#This Row],[Juror 1]:[Juror 20]])-1),\n        SUM(Tabelle_Auswertung[[#This Row],[Juror 1]:[Juror 20]])\n    ),\n\" - \")","v":50},{"$f":"IF(Tabelle_Auswertung[[#This Row],[Bildname]]<>\"\",IF(Tabelle_Auswertung[[#This Row],[Punkte]]>0,AVERAGE(Tabelle_Auswertung[[#This Row],[Juror 1]:[Juror 20]]),\" - \"),\" - \")","v":{"v":6.25,"d":"6.25 "}},{"$f":"IF(Tabelle_Auswertung[[#This Row],[Bildname]]<>\"\",IF(Tabelle_Auswertung[[#This Row],[Punkte]]>0,RANK(Tabelle_Auswertung[[#This Row],[Punkte]],[Punkte],0),\" - \"),\" - \")","v":24},"Chris Finsterer",null,{"$f":"IF(Tabelle_Auswertung[[#This Row],[Platz]]=1,CONCATENATE(Tabelle_Auswertung[[#This Row],[Bildname]],\" von \",Tabelle_Auswertung[[#This Row],[Autor(in)]]),\"\")","v":""},{"$f":"IF(Tabelle_Auswertung[[#This Row],[Platz]]=2,CONCATENATE(Tabelle_Auswertung[[#This Row],[Bildname]],\" von \",Tabelle_Auswertung[[#This Row],[Autor(in)]]),\"\")","v":""},{"$f":"IF(Tabelle_Auswertung[[#This Row],[Platz]]=3,CONCATENATE(Tabelle_Auswertung[[#This Row],[Bildname]],\" von \",Tabelle_Auswertung[[#This Row],[Autor(in)]]),\"\")","v":""},{"$f":"IF(Tabelle_Auswertung[[#This Row],[Platz]]=4,CONCATENATE(Tabelle_Auswertung[[#This Row],[Bildname]],\" von \",Tabelle_Auswertung[[#This Row],[Autor(in)]]),\"\")","v":""},{"$f":"IF(Tabelle_Auswertung[[#This Row],[Platz]]=5,CONCATENATE(Tabelle_Auswertung[[#This Row],[Bildname]],\" von \",Tabelle_Auswertung[[#This Row],[Autor(in)]]),\"\")","v":""},{"$f":"IF(Tabelle_Auswertung[[#This Row],[Platz]]=6,CONCATENATE(Tabelle_Auswertung[[#This Row],[Bildname]],\" von \",Tabelle_Auswertung[[#This Row],[Autor(in)]]),\"\")","v":""},{"$f":"IF(Tabelle_Auswertung[[#This Row],[Platz]]=7,CONCATENATE(Tabelle_Auswertung[[#This Row],[Bildname]],\" von \",Tabelle_Auswertung[[#This Row],[Autor(in)]]),\"\")","v":""},{"$f":"IF(Tabelle_Auswertung[[#This Row],[Platz]]=8,CONCATENATE(Tabelle_Auswertung[[#This Row],[Bildname]],\" von \",Tabelle_Auswertung[[#This Row],[Autor(in)]]),\"\")","v":""},{"$f":"IF(Tabelle_Auswertung[[#This Row],[Platz]]=9,CONCATENATE(Tabelle_Auswertung[[#This Row],[Bildname]],\" von \",Tabelle_Auswertung[[#This Row],[Autor(in)]]),\"\")","v":""},{"$f":"IF(Tabelle_Auswertung[[#This Row],[Platz]]=10,CONCATENATE(Tabelle_Auswertung[[#This Row],[Bildname]],\" von \",Tabelle_Auswertung[[#This Row],[Autor(in)]]),\"\")","v":""}]
[25,"Kristalle-1.jpg",9,7,6,7,8,8,0,5,{"$nulls":12},{"$f":"IF(Tabelle_Auswertung[[#This Row],[Bildname]]<>\"\",\n    IF(Tabelle_Auswertung[[#This Row],[abwesend]]=\"ja\",\n        SUM(Tabelle_Auswertung[[#This Row],[Juror 1]:[Juror 20]])/COUNT(Tabelle_Auswertung[[#This Row],[Juror 1]:[Juror 20]])*(COUNT(Tabelle_Auswertung[[#This Row],[Juror 1]:[Juror 20]])-1),\n        SUM(Tabelle_Auswertung[[#This Row],[Juror 1]:[Juror 20]])\n    ),\n\" - \")","v":50},{"$f":"IF(Tabelle_Auswertung[[#This Row],[Bildname]]<>\"\",IF(Tabelle_Auswertung[[#This Row],[Punkte]]>0,AVERAGE(Tabelle_Auswertung[[#This Row],[Juror 1]:[Juror 20]]),\" - \"),\" - \")","v":6.25},{"$f":"IF(Tabelle_Auswertung[[#This Row],[Bildname]]<>\"\",IF(Tabelle_Auswertung[[#This Row],[Punkte]]>0,RANK(Tabelle_Auswertung[[#This Row],[Punkte]],[Punkte],0),\" - \"),\" - \")","v":24},"Oliver von Guérard",null,{"$f":"IF(Tabelle_Auswertung[[#This Row],[Platz]]=1,CONCATENATE(Tabelle_Auswertung[[#This Row],[Bildname]],\" von \",Tabelle_Auswertung[[#This Row],[Autor(in)]]),\"\")","v":""},{"$f":"IF(Tabelle_Auswertung[[#This Row],[Platz]]=2,CONCATENATE(Tabelle_Auswertung[[#This Row],[Bildname]],\" von \",Tabelle_Auswertung[[#This Row],[Autor(in)]]),\"\")","v":""},{"$f":"IF(Tabelle_Auswertung[[#This Row],[Platz]]=3,CONCATENATE(Tabelle_Auswertung[[#This Row],[Bildname]],\" von \",Tabelle_Auswertung[[#This Row],[Autor(in)]]),\"\")","v":""},{"$f":"IF(Tabelle_Auswertung[[#This Row],[Platz]]=4,CONCATENATE(Tabelle_Auswertung[[#This Row],[Bildname]],\" von \",Tabelle_Auswertung[[#This Row],[Autor(in)]]),\"\")","v":""},{"$f":"IF(Tabelle_Auswertung[[#This Row],[Platz]]=5,CONCATENATE(Tabelle_Auswertung[[#This Row],[Bildname]],\" von \",Tabelle_Auswertung[[#This Row],[Autor(in)]]),\"\")","v":""},{"$f":"IF(Tabelle_Auswertung[[#This Row],[Platz]]=6,CONCATENATE(Tabelle_Auswertung[[#This Row],[Bildname]],\" von \",Tabelle_Auswertung[[#This Row],[Autor(in)]]),\"\")","v":""},{"$f":"IF(Tabelle_Auswertung[[#This Row],[Platz]]=7,CONCATENATE(Tabelle_Auswertung[[#This Row],[Bildname]],\" von \",Tabelle_Auswertung[[#This Row],[Autor(in)]]),\"\")","v":""},{"$f":"IF(Tabelle_Auswertung[[#This Row],[Platz]]=8,CONCATENATE(Tabelle_Auswertung[[#This Row],[Bildname]],\" von \",Tabelle_Auswertung[[#This Row],[Autor(in)]]),\"\")","v":""},{"$f":"IF(Tabelle_Auswertung[[#This Row],[Platz]]=9,CONCATENATE(Tabelle_Auswertung[[#This Row],[Bildname]],\" von \",Tabelle_Auswertung[[#This Row],[Autor(in)]]),\"\")","v":""},{"$f":"IF(Tabelle_Auswertung[[#This Row],[Platz]]=10,CONCATENATE(Tabelle_Auswertung[[#This Row],[Bildname]],\" von \",Tabelle_Auswertung[[#This Row],[Autor(in)]]),\"\")","v":""}]
[26,"Marienkäfer.JPG",7,0,6,9,8,8,4,8,{"$nulls":12},{"$f":"IF(Tabelle_Auswertung[[#This Row],[Bildname]]<>\"\",\n    IF(Tabelle_Auswertung[[#This Row],[abwesend]]=\"ja\",\n        SUM(Tabelle_Auswertung[[#This Row],[Juror 1]:[Juror 20]])/COUNT(Tabelle_Auswertung[[#This Row],[Juror 1]:[Juror 20]])*(COUNT(Tabelle_Auswertung[[#This Row],[Juror 1]:[Juror 20]])-1),\n        SUM(Tabelle_Auswertung[[#This Row],[Juror 1]:[Juror 20]])\n    ),\n\" - \")","v":50},{"$f":"IF(Tabelle_Auswertung[[#This Row],[Bildname]]<>\"\",IF(Tabelle_Auswertung[[#This Row],[Punkte]]>0,AVERAGE(Tabelle_Auswertung[[#This Row],[Juror 1]:[Juror 20]]),\" - \"),\" - \")","v":{"v":6.25,"d":"6.25 "}},{"$f":"IF(Tabelle_Auswertung[[#This Row],[Bildname]]<>\"\",IF(Tabelle_Auswertung[[#This Row],[Punkte]]>0,RANK(Tabelle_Auswertung[[#This Row],[Punkte]],[Punkte],0),\" - \"),\" - \")","v":24},"Nadja Cassim",null,{"$f":"IF(Tabelle_Auswertung[[#This Row],[Platz]]=1,CONCATENATE(Tabelle_Auswertung[[#This Row],[Bildname]],\" von \",Tabelle_Auswertung[[#This Row],[Autor(in)]]),\"\")","v":""},{"$f":"IF(Tabelle_Auswertung[[#This Row],[Platz]]=2,CONCATENATE(Tabelle_Auswertung[[#This Row],[Bildname]],\" von \",Tabelle_Auswertung[[#This Row],[Autor(in)]]),\"\")","v":""},{"$f":"IF(Tabelle_Auswertung[[#This Row],[Platz]]=3,CONCATENATE(Tabelle_Auswertung[[#This Row],[Bildname]],\" von \",Tabelle_Auswertung[[#This Row],[Autor(in)]]),\"\")","v":""},{"$f":"IF(Tabelle_Auswertung[[#This Row],[Platz]]=4,CONCATENATE(Tabelle_Auswertung[[#This Row],[Bildname]],\" von \",Tabelle_Auswertung[[#This Row],[Autor(in)]]),\"\")","v":""},{"$f":"IF(Tabelle_Auswertung[[#This Row],[Platz]]=5,CONCATENATE(Tabelle_Auswertung[[#This Row],[Bildname]],\" von \",Tabelle_Auswertung[[#This Row],[Autor(in)]]),\"\")","v":""},{"$f":"IF(Tabelle_Auswertung[[#This Row],[Platz]]=6,CONCATENATE(Tabelle_Auswertung[[#This Row],[Bildname]],\" von \",Tabelle_Auswertung[[#This Row],[Autor(in)]]),\"\")","v":""},{"$f":"IF(Tabelle_Auswertung[[#This Row],[Platz]]=7,CONCATENATE(Tabelle_Auswertung[[#This Row],[Bildname]],\" von \",Tabelle_Auswertung[[#This Row],[Autor(in)]]),\"\")","v":""},{"$f":"IF(Tabelle_Auswertung[[#This Row],[Platz]]=8,CONCATENATE(Tabelle_Auswertung[[#This Row],[Bildname]],\" von \",Tabelle_Auswertung[[#This Row],[Autor(in)]]),\"\")","v":""},{"$f":"IF(Tabelle_Auswertung[[#This Row],[Platz]]=9,CONCATENATE(Tabelle_Auswertung[[#This Row],[Bildname]],\" von \",Tabelle_Auswertung[[#This Row],[Autor(in)]]),\"\")","v":""},{"$f":"IF(Tabelle_Auswertung[[#This Row],[Platz]]=10,CONCATENATE(Tabelle_Auswertung[[#This Row],[Bildname]],\" von \",Tabelle_Auswertung[[#This Row],[Autor(in)]]),\"\")","v":""}]
[27,"frühmorgens.JPG",7,8,5,8,9,7,5,7,{"$nulls":12},{"$f":"IF(Tabelle_Auswertung[[#This Row],[Bildname]]<>\"\",\n    IF(Tabelle_Auswertung[[#This Row],[abwesend]]=\"ja\",\n        SUM(Tabelle_Auswertung[[#This Row],[Juror 1]:[Juror 20]])/COUNT(Tabelle_Auswertung[[#This Row],[Juror 1]:[Juror 20]])*(COUNT(Tabelle_Auswertung[[#This Row],[Juror 1]:[Juror 20]])-1),\n        SUM(Tabelle_Auswertung[[#This Row],[Juror 1]:[Juror 20]])\n    ),\n\" - \")","v":49},{"$f":"IF(Tabelle_Auswertung[[#This Row],[Bildname]]<>\"\",IF(Tabelle_Auswertung[[#This Row],[Punkte]]>0,AVERAGE(Tabelle_Auswertung[[#This Row],[Juror 1]:[Juror 20]]),\" - \"),\" - \")","v":{"v":7,"d":"7.00 "}},{"$f":"IF(Tabelle_Auswertung[[#This Row],[Bildname]]<>\"\",IF(Tabelle_Auswertung[[#This Row],[Punkte]]>0,RANK(Tabelle_Auswertung[[#This Row],[Punkte]],[Punkte],0),\" - \"),\" - \")","v":27},"Susanne Deinhardt","ja",{"$f":"IF(Tabelle_Auswertung[[#This Row],[Platz]]=1,CONCATENATE(Tabelle_Auswertung[[#This Row],[Bildname]],\" von \",Tabelle_Auswertung[[#This Row],[Autor(in)]]),\"\")","v":""},{"$f":"IF(Tabelle_Auswertung[[#This Row],[Platz]]=2,CONCATENATE(Tabelle_Auswertung[[#This Row],[Bildname]],\" von \",Tabelle_Auswertung[[#This Row],[Autor(in)]]),\"\")","v":""},{"$f":"IF(Tabelle_Auswertung[[#This Row],[Platz]]=3,CONCATENATE(Tabelle_Auswertung[[#This Row],[Bildname]],\" von \",Tabelle_Auswertung[[#This Row],[Autor(in)]]),\"\")","v":""},{"$f":"IF(Tabelle_Auswertung[[#This Row],[Platz]]=4,CONCATENATE(Tabelle_Auswertung[[#This Row],[Bildname]],\" von \",Tabelle_Auswertung[[#This Row],[Autor(in)]]),\"\")","v":""},{"$f":"IF(Tabelle_Auswertung[[#This Row],[Platz]]=5,CONCATENATE(Tabelle_Auswertung[[#This Row],[Bildname]],\" von \",Tabelle_Auswertung[[#This Row],[Autor(in)]]),\"\")","v":""},{"$f":"IF(Tabelle_Auswertung[[#This Row],[Platz]]=6,CONCATENATE(Tabelle_Auswertung[[#This Row],[Bildname]],\" von \",Tabelle_Auswertung[[#This Row],[Autor(in)]]),\"\")","v":""},{"$f":"IF(Tabelle_Auswertung[[#This Row],[Platz]]=7,CONCATENATE(Tabelle_Auswertung[[#This Row],[Bildname]],\" von \",Tabelle_Auswertung[[#This Row],[Autor(in)]]),\"\")","v":""},{"$f":"IF(Tabelle_Auswertung[[#This Row],[Platz]]=8,CONCATENATE(Tabelle_Auswertung[[#This Row],[Bildname]],\" von \",Tabelle_Auswertung[[#This Row],[Autor(in)]]),\"\")","v":""},{"$f":"IF(Tabelle_Auswertung[[#This Row],[Platz]]=9,CONCATENATE(Tabelle_Auswertung[[#This Row],[Bildname]],\" von \",Tabelle_Auswertung[[#This Row],[Autor(in)]]),\"\")","v":""},{"$f":"IF(Tabelle_Auswertung[[#This Row],[Platz]]=10,CONCATENATE(Tabelle_Auswertung[[#This Row],[Bildname]],\" von \",Tabelle_Auswertung[[#This Row],[Autor(in)]]),\"\")","v":""}]
[28,"Moos.JPG",6,0,8,8,9,6,7,5,{"$nulls":12},{"$f":"IF(Tabelle_Auswertung[[#This Row],[Bildname]]<>\"\",\n    IF(Tabelle_Auswertung[[#This Row],[abwesend]]=\"ja\",\n        SUM(Tabelle_Auswertung[[#This Row],[Juror 1]:[Juror 20]])/COUNT(Tabelle_Auswertung[[#This Row],[Juror 1]:[Juror 20]])*(COUNT(Tabelle_Auswertung[[#This Row],[Juror 1]:[Juror 20]])-1),\n        SUM(Tabelle_Auswertung[[#This Row],[Juror 1]:[Juror 20]])\n    ),\n\" - \")","v":49},{"$f":"IF(Tabelle_Auswertung[[#This Row],[Bildname]]<>\"\",IF(Tabelle_Auswertung[[#This Row],[Punkte]]>0,AVERAGE(Tabelle_Auswertung[[#This Row],[Juror 1]:[Juror 20]]),\" - \"),\" - \")","v":{"v":6.125,"d":"6.13 "}},{"$f":"IF(Tabelle_Auswertung[[#This Row],[Bildname]]<>\"\",IF(Tabelle_Auswertung[[#This Row],[Punkte]]>0,RANK(Tabelle_Auswertung[[#This Row],[Punkte]],[Punkte],0),\" - \"),\" - \")","v":27},"Nadja Cassim",null,{"$f":"IF(Tabelle_Auswertung[[#This Row],[Platz]]=1,CONCATENATE(Tabelle_Auswertung[[#This Row],[Bildname]],\" von \",Tabelle_Auswertung[[#This Row],[Autor(in)]]),\"\")","v":""},{"$f":"IF(Tabelle_Auswertung[[#This Row],[Platz]]=2,CONCATENATE(Tabelle_Auswertung[[#This Row],[Bildname]],\" von \",Tabelle_Auswertung[[#This Row],[Autor(in)]]),\"\")","v":""},{"$f":"IF(Tabelle_Auswertung[[#This Row],[Platz]]=3,CONCATENATE(Tabelle_Auswertung[[#This Row],[Bildname]],\" von \",Tabelle_Auswertung[[#This Row],[Autor(in)]]),\"\")","v":""},{"$f":"IF(Tabelle_Auswertung[[#This Row],[Platz]]=4,CONCATENATE(Tabelle_Auswertung[[#This Row],[Bildname]],\" von \",Tabelle_Auswertung[[#This Row],[Autor(in)]]),\"\")","v":""},{"$f":"IF(Tabelle_Auswertung[[#This Row],[Platz]]=5,CONCATENATE(Tabelle_Auswertung[[#This Row],[Bildname]],\" von \",Tabelle_Auswertung[[#This Row],[Autor(in)]]),\"\")","v":""},{"$f":"IF(Tabelle_Auswertung[[#This Row],[Platz]]=6,CONCATENATE(Tabelle_Auswertung[[#This Row],[Bildname]],\" von \",Tabelle_Auswertung[[#This Row],[Autor(in)]]),\"\")","v":""},{"$f":"IF(Tabelle_Auswertung[[#This Row],[Platz]]=7,CONCATENATE(Tabelle_Auswertung[[#This Row],[Bildname]],\" von \",Tabelle_Auswertung[[#This Row],[Autor(in)]]),\"\")","v":""},{"$f":"IF(Tabelle_Auswertung[[#This Row],[Platz]]=8,CONCATENATE(Tabelle_Auswertung[[#This Row],[Bildname]],\" von \",Tabelle_Auswertung[[#This Row],[Autor(in)]]),\"\")","v":""},{"$f":"IF(Tabelle_Auswertung[[#This Row],[Platz]]=9,CONCATENATE(Tabelle_Auswertung[[#This Row],[Bildname]],\" von \",Tabelle_Auswertung[[#This Row],[Autor(in)]]),\"\")","v":""},{"$f":"IF(Tabelle_Auswertung[[#This Row],[Platz]]=10,CONCATENATE(Tabelle_Auswertung[[#This Row],[Bildname]],\" von \",Tabelle_Auswertung[[#This Row],[Autor(in)]]),\"\")","v":""}]
[29,"Zeil.jpg",7,7,8,9,0,8,4,6,{"$nulls":12},{"$f":"IF(Tabelle_Auswertung[[#This Row],[Bildname]]<>\"\",\n    IF(Tabelle_Auswertung[[#This Row],[abwesend]]=\"ja\",\n        SUM(Tabelle_Auswertung[[#This Row],[Juror 1]:[Juror 20]])/COUNT(Tabelle_Auswertung[[#This Row],[Juror 1]:[Juror 20]])*(COUNT(Tabelle_Auswertung[[#This Row],[Juror 1]:[Juror 20]])-1),\n        SUM(Tabelle_Auswertung[[#This Row],[Juror 1]:[Juror 20]])\n    ),\n\" - \")","v":49},{"$f":"IF(Tabelle_Auswertung[[#This Row],[Bildname]]<>\"\",IF(Tabelle_Auswertung[[#This Row],[Punkte]]>0,AVERAGE(Tabelle_Auswertung[[#This Row],[Juror 1]:[Juror 20]]),\" - \"),\" - \")","v":6.125},{"$f":"IF(Tabelle_Auswertung[[#This Row],[Bildname]]<>\"\",IF(Tabelle_Auswertung[[#This Row],[Punkte]]>0,RANK(Tabelle_Auswertung[[#This Row],[Punkte]],[Punkte],0),\" - \"),\" - \")","v":27},"Jan Grünler",null,{"$f":"IF(Tabelle_Auswertung[[#This Row],[Platz]]=1,CONCATENATE(Tabelle_Auswertung[[#This Row],[Bildname]],\" von \",Tabelle_Auswertung[[#This Row],[Autor(in)]]),\"\")","v":""},{"$f":"IF(Tabelle_Auswertung[[#This Row],[Platz]]=2,CONCATENATE(Tabelle_Auswertung[[#This Row],[Bildname]],\" von \",Tabelle_Auswertung[[#This Row],[Autor(in)]]),\"\")","v":""},{"$f":"IF(Tabelle_Auswertung[[#This Row],[Platz]]=3,CONCATENATE(Tabelle_Auswertung[[#This Row],[Bildname]],\" von \",Tabelle_Auswertung[[#This Row],[Autor(in)]]),\"\")","v":""},{"$f":"IF(Tabelle_Auswertung[[#This Row],[Platz]]=4,CONCATENATE(Tabelle_Auswertung[[#This Row],[Bildname]],\" von \",Tabelle_Auswertung[[#This Row],[Autor(in)]]),\"\")","v":""},{"$f":"IF(Tabelle_Auswertung[[#This Row],[Platz]]=5,CONCATENATE(Tabelle_Auswertung[[#This Row],[Bildname]],\" von \",Tabelle_Auswertung[[#This Row],[Autor(in)]]),\"\")","v":""},{"$f":"IF(Tabelle_Auswertung[[#This Row],[Platz]]=6,CONCATENATE(Tabelle_Auswertung[[#This Row],[Bildname]],\" von \",Tabelle_Auswertung[[#This Row],[Autor(in)]]),\"\")","v":""},{"$f":"IF(Tabelle_Auswertung[[#This Row],[Platz]]=7,CONCATENATE(Tabelle_Auswertung[[#This Row],[Bildname]],\" von \",Tabelle_Auswertung[[#This Row],[Autor(in)]]),\"\")","v":""},{"$f":"IF(Tabelle_Auswertung[[#This Row],[Platz]]=8,CONCATENATE(Tabelle_Auswertung[[#This Row],[Bildname]],\" von \",Tabelle_Auswertung[[#This Row],[Autor(in)]]),\"\")","v":""},{"$f":"IF(Tabelle_Auswertung[[#This Row],[Platz]]=9,CONCATENATE(Tabelle_Auswertung[[#This Row],[Bildname]],\" von \",Tabelle_Auswertung[[#This Row],[Autor(in)]]),\"\")","v":""},{"$f":"IF(Tabelle_Auswertung[[#This Row],[Platz]]=10,CONCATENATE(Tabelle_Auswertung[[#This Row],[Bildname]],\" von \",Tabelle_Auswertung[[#This Row],[Autor(in)]]),\"\")","v":""}]
[30,"old and new.jpg",6,8,6,7,7,7,7,0,{"$nulls":12},{"$f":"IF(Tabelle_Auswertung[[#This Row],[Bildname]]<>\"\",\n    IF(Tabelle_Auswertung[[#This Row],[abwesend]]=\"ja\",\n        SUM(Tabelle_Auswertung[[#This Row],[Juror 1]:[Juror 20]])/COUNT(Tabelle_Auswertung[[#This Row],[Juror 1]:[Juror 20]])*(COUNT(Tabelle_Auswertung[[#This Row],[Juror 1]:[Juror 20]])-1),\n        SUM(Tabelle_Auswertung[[#This Row],[Juror 1]:[Juror 20]])\n    ),\n\" - \")","v":48},{"$f":"IF(Tabelle_Auswertung[[#This Row],[Bildname]]<>\"\",IF(Tabelle_Auswertung[[#This Row],[Punkte]]>0,AVERAGE(Tabelle_Auswertung[[#This Row],[Juror 1]:[Juror 20]]),\" - \"),\" - \")","v":{"v":6,"d":"6.00 "}},{"$f":"IF(Tabelle_Auswertung[[#This Row],[Bildname]]<>\"\",IF(Tabelle_Auswertung[[#This Row],[Punkte]]>0,RANK(Tabelle_Auswertung[[#This Row],[Punkte]],[Punkte],0),\" - \"),\" - \")","v":30},"Gerhard Rieß",null,{"$f":"IF(Tabelle_Auswertung[[#This Row],[Platz]]=1,CONCATENATE(Tabelle_Auswertung[[#This Row],[Bildname]],\" von \",Tabelle_Auswertung[[#This Row],[Autor(in)]]),\"\")","v":""},{"$f":"IF(Tabelle_Auswertung[[#This Row],[Platz]]=2,CONCATENATE(Tabelle_Auswertung[[#This Row],[Bildname]],\" von \",Tabelle_Auswertung[[#This Row],[Autor(in)]]),\"\")","v":""},{"$f":"IF(Tabelle_Auswertung[[#This Row],[Platz]]=3,CONCATENATE(Tabelle_Auswertung[[#This Row],[Bildname]],\" von \",Tabelle_Auswertung[[#This Row],[Autor(in)]]),\"\")","v":""},{"$f":"IF(Tabelle_Auswertung[[#This Row],[Platz]]=4,CONCATENATE(Tabelle_Auswertung[[#This Row],[Bildname]],\" von \",Tabelle_Auswertung[[#This Row],[Autor(in)]]),\"\")","v":""},{"$f":"IF(Tabelle_Auswertung[[#This Row],[Platz]]=5,CONCATENATE(Tabelle_Auswertung[[#This Row],[Bildname]],\" von \",Tabelle_Auswertung[[#This Row],[Autor(in)]]),\"\")","v":""},{"$f":"IF(Tabelle_Auswertung[[#This Row],[Platz]]=6,CONCATENATE(Tabelle_Auswertung[[#This Row],[Bildname]],\" von \",Tabelle_Auswertung[[#This Row],[Autor(in)]]),\"\")","v":""},{"$f":"IF(Tabelle_Auswertung[[#This Row],[Platz]]=7,CONCATENATE(Tabelle_Auswertung[[#This Row],[Bildname]],\" von \",Tabelle_Auswertung[[#This Row],[Autor(in)]]),\"\")","v":""},{"$f":"IF(Tabelle_Auswertung[[#This Row],[Platz]]=8,CONCATENATE(Tabelle_Auswertung[[#This Row],[Bildname]],\" von \",Tabelle_Auswertung[[#This Row],[Autor(in)]]),\"\")","v":""},{"$f":"IF(Tabelle_Auswertung[[#This Row],[Platz]]=9,CONCATENATE(Tabelle_Auswertung[[#This Row],[Bildname]],\" von \",Tabelle_Auswertung[[#This Row],[Autor(in)]]),\"\")","v":""},{"$f":"IF(Tabelle_Auswertung[[#This Row],[Platz]]=10,CONCATENATE(Tabelle_Auswertung[[#This Row],[Bildname]],\" von \",Tabelle_Auswertung[[#This Row],[Autor(in)]]),\"\")","v":""}]
[31,"Muh.jpg",8,8,6,9,0,9,3,4,{"$nulls":12},{"$f":"IF(Tabelle_Auswertung[[#This Row],[Bildname]]<>\"\",\n    IF(Tabelle_Auswertung[[#This Row],[abwesend]]=\"ja\",\n        SUM(Tabelle_Auswertung[[#This Row],[Juror 1]:[Juror 20]])/COUNT(Tabelle_Auswertung[[#This Row],[Juror 1]:[Juror 20]])*(COUNT(Tabelle_Auswertung[[#This Row],[Juror 1]:[Juror 20]])-1),\n        SUM(Tabelle_Auswertung[[#This Row],[Juror 1]:[Juror 20]])\n    ),\n\" - \")","v":47},{"$f":"IF(Tabelle_Auswertung[[#This Row],[Bildname]]<>\"\",IF(Tabelle_Auswertung[[#This Row],[Punkte]]>0,AVERAGE(Tabelle_Auswertung[[#This Row],[Juror 1]:[Juror 20]]),\" - \"),\" - \")","v":{"v":5.875,"d":"5.88 "}},{"$f":"IF(Tabelle_Auswertung[[#This Row],[Bildname]]<>\"\",IF(Tabelle_Auswertung[[#This Row],[Punkte]]>0,RANK(Tabelle_Auswertung[[#This Row],[Punkte]],[Punkte],0),\" - \"),\" - \")","v":31},"Jan Grünler",null,{"$f":"IF(Tabelle_Auswertung[[#This Row],[Platz]]=1,CONCATENATE(Tabelle_Auswertung[[#This Row],[Bildname]],\" von \",Tabelle_Auswertung[[#This Row],[Autor(in)]]),\"\")","v":""},{"$f":"IF(Tabelle_Auswertung[[#This Row],[Platz]]=2,CONCATENATE(Tabelle_Auswertung[[#This Row],[Bildname]],\" von \",Tabelle_Auswertung[[#This Row],[Autor(in)]]),\"\")","v":""},{"$f":"IF(Tabelle_Auswertung[[#This Row],[Platz]]=3,CONCATENATE(Tabelle_Auswertung[[#This Row],[Bildname]],\" von \",Tabelle_Auswertung[[#This Row],[Autor(in)]]),\"\")","v":""},{"$f":"IF(Tabelle_Auswertung[[#This Row],[Platz]]=4,CONCATENATE(Tabelle_Auswertung[[#This Row],[Bildname]],\" von \",Tabelle_Auswertung[[#This Row],[Autor(in)]]),\"\")","v":""},{"$f":"IF(Tabelle_Auswertung[[#This Row],[Platz]]=5,CONCATENATE(Tabelle_Auswertung[[#This Row],[Bildname]],\" von \",Tabelle_Auswertung[[#This Row],[Autor(in)]]),\"\")","v":""},{"$f":"IF(Tabelle_Auswertung[[#This Row],[Platz]]=6,CONCATENATE(Tabelle_Auswertung[[#This Row],[Bildname]],\" von \",Tabelle_Auswertung[[#This Row],[Autor(in)]]),\"\")","v":""},{"$f":"IF(Tabelle_Auswertung[[#This Row],[Platz]]=7,CONCATENATE(Tabelle_Auswertung[[#This Row],[Bildname]],\" von \",Tabelle_Auswertung[[#This Row],[Autor(in)]]),\"\")","v":""},{"$f":"IF(Tabelle_Auswertung[[#This Row],[Platz]]=8,CONCATENATE(Tabelle_Auswertung[[#This Row],[Bildname]],\" von \",Tabelle_Auswertung[[#This Row],[Autor(in)]]),\"\")","v":""},{"$f":"IF(Tabelle_Auswertung[[#This Row],[Platz]]=9,CONCATENATE(Tabelle_Auswertung[[#This Row],[Bildname]],\" von \",Tabelle_Auswertung[[#This Row],[Autor(in)]]),\"\")","v":""},{"$f":"IF(Tabelle_Auswertung[[#This Row],[Platz]]=10,CONCATENATE(Tabelle_Auswertung[[#This Row],[Bildname]],\" von \",Tabelle_Auswertung[[#This Row],[Autor(in)]]),\"\")","v":""}]
[32,"Trompetenmoos.JPG",6,0,6,8,8,6,7,6,{"$nulls":12},{"$f":"IF(Tabelle_Auswertung[[#This Row],[Bildname]]<>\"\",\n    IF(Tabelle_Auswertung[[#This Row],[abwesend]]=\"ja\",\n        SUM(Tabelle_Auswertung[[#This Row],[Juror 1]:[Juror 20]])/COUNT(Tabelle_Auswertung[[#This Row],[Juror 1]:[Juror 20]])*(COUNT(Tabelle_Auswertung[[#This Row],[Juror 1]:[Juror 20]])-1),\n        SUM(Tabelle_Auswertung[[#This Row],[Juror 1]:[Juror 20]])\n    ),\n\" - \")","v":47},{"$f":"IF(Tabelle_Auswertung[[#This Row],[Bildname]]<>\"\",IF(Tabelle_Auswertung[[#This Row],[Punkte]]>0,AVERAGE(Tabelle_Auswertung[[#This Row],[Juror 1]:[Juror 20]]),\" - \"),\" - \")","v":5.875},{"$f":"IF(Tabelle_Auswertung[[#This Row],[Bildname]]<>\"\",IF(Tabelle_Auswertung[[#This Row],[Punkte]]>0,RANK(Tabelle_Auswertung[[#This Row],[Punkte]],[Punkte],0),\" - \"),\" - \")","v":31},"Nadja Cassim",null,{"$f":"IF(Tabelle_Auswertung[[#This Row],[Platz]]=1,CONCATENATE(Tabelle_Auswertung[[#This Row],[Bildname]],\" von \",Tabelle_Auswertung[[#This Row],[Autor(in)]]),\"\")","v":""},{"$f":"IF(Tabelle_Auswertung[[#This Row],[Platz]]=2,CONCATENATE(Tabelle_Auswertung[[#This Row],[Bildname]],\" von \",Tabelle_Auswertung[[#This Row],[Autor(in)]]),\"\")","v":""},{"$f":"IF(Tabelle_Auswertung[[#This Row],[Platz]]=3,CONCATENATE(Tabelle_Auswertung[[#This Row],[Bildname]],\" von \",Tabelle_Auswertung[[#This Row],[Autor(in)]]),\"\")","v":""},{"$f":"IF(Tabelle_Auswertung[[#This Row],[Platz]]=4,CONCATENATE(Tabelle_Auswertung[[#This Row],[Bildname]],\" von \",Tabelle_Auswertung[[#This Row],[Autor(in)]]),\"\")","v":""},{"$f":"IF(Tabelle_Auswertung[[#This Row],[Platz]]=5,CONCATENATE(Tabelle_Auswertung[[#This Row],[Bildname]],\" von \",Tabelle_Auswertung[[#This Row],[Autor(in)]]),\"\")","v":""},{"$f":"IF(Tabelle_Auswertung[[#This Row],[Platz]]=6,CONCATENATE(Tabelle_Auswertung[[#This Row],[Bildname]],\" von \",Tabelle_Auswertung[[#This Row],[Autor(in)]]),\"\")","v":""},{"$f":"IF(Tabelle_Auswertung[[#This Row],[Platz]]=7,CONCATENATE(Tabelle_Auswertung[[#This Row],[Bildname]],\" von \",Tabelle_Auswertung[[#This Row],[Autor(in)]]),\"\")","v":""},{"$f":"IF(Tabelle_Auswertung[[#This Row],[Platz]]=8,CONCATENATE(Tabelle_Auswertung[[#This Row],[Bildname]],\" von \",Tabelle_Auswertung[[#This Row],[Autor(in)]]),\"\")","v":""},{"$f":"IF(Tabelle_Auswertung[[#This Row],[Platz]]=9,CONCATENATE(Tabelle_Auswertung[[#This Row],[Bildname]],\" von \",Tabelle_Auswertung[[#This Row],[Autor(in)]]),\"\")","v":""},{"$f":"IF(Tabelle_Auswertung[[#This Row],[Platz]]=10,CONCATENATE(Tabelle_Auswertung[[#This Row],[Bildname]],\" von \",Tabelle_Auswertung[[#This Row],[Autor(in)]]),\"\")","v":""}]
[33,"Irish sunset.JPG",6,9,8,8,5,6,5,6,{"$nulls":12},{"$f":"IF(Tabelle_Auswertung[[#This Row],[Bildname]]<>\"\",\n    IF(Tabelle_Auswertung[[#This Row],[abwesend]]=\"ja\",\n        SUM(Tabelle_Auswertung[[#This Row],[Juror 1]:[Juror 20]])/COUNT(Tabelle_Auswertung[[#This Row],[Juror 1]:[Juror 20]])*(COUNT(Tabelle_Auswertung[[#This Row],[Juror 1]:[Juror 20]])-1),\n        SUM(Tabelle_Auswertung[[#This Row],[Juror 1]:[Juror 20]])\n    ),\n\" - \")","v":46.375},{"$f":"IF(Tabelle_Auswertung[[#This Row],[Bildname]]<>\"\",IF(Tabelle_Auswertung[[#This Row],[Punkte]]>0,AVERAGE(Tabelle_Auswertung[[#This Row],[Juror 1]:[Juror 20]]),\" - \"),\" - \")","v":{"v":6.625,"d":"6.63 "}},{"$f":"IF(Tabelle_Auswertung[[#This Row],[Bildname]]<>\"\",IF(Tabelle_Auswertung[[#This Row],[Punkte]]>0,RANK(Tabelle_Auswertung[[#This Row],[Punkte]],[Punkte],0),\" - \"),\" - \")","v":33},"Susanne Deinhardt","ja",{"$f":"IF(Tabelle_Auswertung[[#This Row],[Platz]]=1,CONCATENATE(Tabelle_Auswertung[[#This Row],[Bildname]],\" von \",Tabelle_Auswertung[[#This Row],[Autor(in)]]),\"\")","v":""},{"$f":"IF(Tabelle_Auswertung[[#This Row],[Platz]]=2,CONCATENATE(Tabelle_Auswertung[[#This Row],[Bildname]],\" von \",Tabelle_Auswertung[[#This Row],[Autor(in)]]),\"\")","v":""},{"$f":"IF(Tabelle_Auswertung[[#This Row],[Platz]]=3,CONCATENATE(Tabelle_Auswertung[[#This Row],[Bildname]],\" von \",Tabelle_Auswertung[[#This Row],[Autor(in)]]),\"\")","v":""},{"$f":"IF(Tabelle_Auswertung[[#This Row],[Platz]]=4,CONCATENATE(Tabelle_Auswertung[[#This Row],[Bildname]],\" von \",Tabelle_Auswertung[[#This Row],[Autor(in)]]),\"\")","v":""},{"$f":"IF(Tabelle_Auswertung[[#This Row],[Platz]]=5,CONCATENATE(Tabelle_Auswertung[[#This Row],[Bildname]],\" von \",Tabelle_Auswertung[[#This Row],[Autor(in)]]),\"\")","v":""},{"$f":"IF(Tabelle_Auswertung[[#This Row],[Platz]]=6,CONCATENATE(Tabelle_Auswertung[[#This Row],[Bildname]],\" von \",Tabelle_Auswertung[[#This Row],[Autor(in)]]),\"\")","v":""},{"$f":"IF(Tabelle_Auswertung[[#This Row],[Platz]]=7,CONCATENATE(Tabelle_Auswertung[[#This Row],[Bildname]],\" von \",Tabelle_Auswertung[[#This Row],[Autor(in)]]),\"\")","v":""},{"$f":"IF(Tabelle_Auswertung[[#This Row],[Platz]]=8,CONCATENATE(Tabelle_Auswertung[[#This Row],[Bildname]],\" von \",Tabelle_Auswertung[[#This Row],[Autor(in)]]),\"\")","v":""},{"$f":"IF(Tabelle_Auswertung[[#This Row],[Platz]]=9,CONCATENATE(Tabelle_Auswertung[[#This Row],[Bildname]],\" von \",Tabelle_Auswertung[[#This Row],[Autor(in)]]),\"\")","v":""},{"$f":"IF(Tabelle_Auswertung[[#This Row],[Platz]]=10,CONCATENATE(Tabelle_Auswertung[[#This Row],[Bildname]],\" von \",Tabelle_Auswertung[[#This Row],[Autor(in)]]),\"\")","v":""}]
[34,"traveling by the speed of light.jpg",5,7,8,0,7,6,5,8,{"$nulls":12},{"$f":"IF(Tabelle_Auswertung[[#This Row],[Bildname]]<>\"\",\n    IF(Tabelle_Auswertung[[#This Row],[abwesend]]=\"ja\",\n        SUM(Tabelle_Auswertung[[#This Row],[Juror 1]:[Juror 20]])/COUNT(Tabelle_Auswertung[[#This Row],[Juror 1]:[Juror 20]])*(COUNT(Tabelle_Auswertung[[#This Row],[Juror 1]:[Juror 20]])-1),\n        SUM(Tabelle_Auswertung[[#This Row],[Juror 1]:[Juror 20]])\n    ),\n\" - \")","v":46},{"$f":"IF(Tabelle_Auswertung[[#This Row],[Bildname]]<>\"\",IF(Tabelle_Auswertung[[#This Row],[Punkte]]>0,AVERAGE(Tabelle_Auswertung[[#This Row],[Juror 1]:[Juror 20]]),\" - \"),\" - \")","v":{"v":5.75,"d":"5.75 "}},{"$f":"IF(Tabelle_Auswertung[[#This Row],[Bildname]]<>\"\",IF(Tabelle_Auswertung[[#This Row],[Punkte]]>0,RANK(Tabelle_Auswertung[[#This Row],[Punkte]],[Punkte],0),\" - \"),\" - \")","v":34},"Chris Finsterer",null,{"$f":"IF(Tabelle_Auswertung[[#This Row],[Platz]]=1,CONCATENATE(Tabelle_Auswertung[[#This Row],[Bildname]],\" von \",Tabelle_Auswertung[[#This Row],[Autor(in)]]),\"\")","v":""},{"$f":"IF(Tabelle_Auswertung[[#This Row],[Platz]]=2,CONCATENATE(Tabelle_Auswertung[[#This Row],[Bildname]],\" von \",Tabelle_Auswertung[[#This Row],[Autor(in)]]),\"\")","v":""},{"$f":"IF(Tabelle_Auswertung[[#This Row],[Platz]]=3,CONCATENATE(Tabelle_Auswertung[[#This Row],[Bildname]],\" von \",Tabelle_Auswertung[[#This Row],[Autor(in)]]),\"\")","v":""},{"$f":"IF(Tabelle_Auswertung[[#This Row],[Platz]]=4,CONCATENATE(Tabelle_Auswertung[[#This Row],[Bildname]],\" von \",Tabelle_Auswertung[[#This Row],[Autor(in)]]),\"\")","v":""},{"$f":"IF(Tabelle_Auswertung[[#This Row],[Platz]]=5,CONCATENATE(Tabelle_Auswertung[[#This Row],[Bildname]],\" von \",Tabelle_Auswertung[[#This Row],[Autor(in)]]),\"\")","v":""},{"$f":"IF(Tabelle_Auswertung[[#This Row],[Platz]]=6,CONCATENATE(Tabelle_Auswertung[[#This Row],[Bildname]],\" von \",Tabelle_Auswertung[[#This Row],[Autor(in)]]),\"\")","v":""},{"$f":"IF(Tabelle_Auswertung[[#This Row],[Platz]]=7,CONCATENATE(Tabelle_Auswertung[[#This Row],[Bildname]],\" von \",Tabelle_Auswertung[[#This Row],[Autor(in)]]),\"\")","v":""},{"$f":"IF(Tabelle_Auswertung[[#This Row],[Platz]]=8,CONCATENATE(Tabelle_Auswertung[[#This Row],[Bildname]],\" von \",Tabelle_Auswertung[[#This Row],[Autor(in)]]),\"\")","v":""},{"$f":"IF(Tabelle_Auswertung[[#This Row],[Platz]]=9,CONCATENATE(Tabelle_Auswertung[[#This Row],[Bildname]],\" von \",Tabelle_Auswertung[[#This Row],[Autor(in)]]),\"\")","v":""},{"$f":"IF(Tabelle_Auswertung[[#This Row],[Platz]]=10,CONCATENATE(Tabelle_Auswertung[[#This Row],[Bildname]],\" von \",Tabelle_Auswertung[[#This Row],[Autor(in)]]),\"\")","v":""}]
[35,"underground.jpg",6,8,4,8,6,8,6,0,{"$nulls":12},{"$f":"IF(Tabelle_Auswertung[[#This Row],[Bildname]]<>\"\",\n    IF(Tabelle_Auswertung[[#This Row],[abwesend]]=\"ja\",\n        SUM(Tabelle_Auswertung[[#This Row],[Juror 1]:[Juror 20]])/COUNT(Tabelle_Auswertung[[#This Row],[Juror 1]:[Juror 20]])*(COUNT(Tabelle_Auswertung[[#This Row],[Juror 1]:[Juror 20]])-1),\n        SUM(Tabelle_Auswertung[[#This Row],[Juror 1]:[Juror 20]])\n    ),\n\" - \")","v":46},{"$f":"IF(Tabelle_Auswertung[[#This Row],[Bildname]]<>\"\",IF(Tabelle_Auswertung[[#This Row],[Punkte]]>0,AVERAGE(Tabelle_Auswertung[[#This Row],[Juror 1]:[Juror 20]]),\" - \"),\" - \")","v":{"v":5.75,"d":"5.75 "}},{"$f":"IF(Tabelle_Auswertung[[#This Row],[Bildname]]<>\"\",IF(Tabelle_Auswertung[[#This Row],[Punkte]]>0,RANK(Tabelle_Auswertung[[#This Row],[Punkte]],[Punkte],0),\" - \"),\" - \")","v":34},"Gerhard Rieß",null,{"$f":"IF(Tabelle_Auswertung[[#This Row],[Platz]]=1,CONCATENATE(Tabelle_Auswertung[[#This Row],[Bildname]],\" von \",Tabelle_Auswertung[[#This Row],[Autor(in)]]),\"\")","v":""},{"$f":"IF(Tabelle_Auswertung[[#This Row],[Platz]]=2,CONCATENATE(Tabelle_Auswertung[[#This Row],[Bildname]],\" von \",Tabelle_Auswertung[[#This Row],[Autor(in)]]),\"\")","v":""},{"$f":"IF(Tabelle_Auswertung[[#This Row],[Platz]]=3,CONCATENATE(Tabelle_Auswertung[[#This Row],[Bildname]],\" von \",Tabelle_Auswertung[[#This Row],[Autor(in)]]),\"\")","v":""},{"$f":"IF(Tabelle_Auswertung[[#This Row],[Platz]]=4,CONCATENATE(Tabelle_Auswertung[[#This Row],[Bildname]],\" von \",Tabelle_Auswertung[[#This Row],[Autor(in)]]),\"\")","v":""},{"$f":"IF(Tabelle_Auswertung[[#This Row],[Platz]]=5,CONCATENATE(Tabelle_Auswertung[[#This Row],[Bildname]],\" von \",Tabelle_Auswertung[[#This Row],[Autor(in)]]),\"\")","v":""},{"$f":"IF(Tabelle_Auswertung[[#This Row],[Platz]]=6,CONCATENATE(Tabelle_Auswertung[[#This Row],[Bildname]],\" von \",Tabelle_Auswertung[[#This Row],[Autor(in)]]),\"\")","v":""},{"$f":"IF(Tabelle_Auswertung[[#This Row],[Platz]]=7,CONCATENATE(Tabelle_Auswertung[[#This Row],[Bildname]],\" von \",Tabelle_Auswertung[[#This Row],[Autor(in)]]),\"\")","v":""},{"$f":"IF(Tabelle_Auswertung[[#This Row],[Platz]]=8,CONCATENATE(Tabelle_Auswertung[[#This Row],[Bildname]],\" von \",Tabelle_Auswertung[[#This Row],[Autor(in)]]),\"\")","v":""},{"$f":"IF(Tabelle_Auswertung[[#This Row],[Platz]]=9,CONCATENATE(Tabelle_Auswertung[[#This Row],[Bildname]],\" von \",Tabelle_Auswertung[[#This Row],[Autor(in)]]),\"\")","v":""},{"$f":"IF(Tabelle_Auswertung[[#This Row],[Platz]]=10,CONCATENATE(Tabelle_Auswertung[[#This Row],[Bildname]],\" von \",Tabelle_Auswertung[[#This Row],[Autor(in)]]),\"\")","v":""}]
[36,"IMG_0850.JPG",7,7,5,6,9,4,8,6,{"$nulls":12},{"$f":"IF(Tabelle_Auswertung[[#This Row],[Bildname]]<>\"\",\n    IF(Tabelle_Auswertung[[#This Row],[abwesend]]=\"ja\",\n        SUM(Tabelle_Auswertung[[#This Row],[Juror 1]:[Juror 20]])/COUNT(Tabelle_Auswertung[[#This Row],[Juror 1]:[Juror 20]])*(COUNT(Tabelle_Auswertung[[#This Row],[Juror 1]:[Juror 20]])-1),\n        SUM(Tabelle_Auswertung[[#This Row],[Juror 1]:[Juror 20]])\n    ),\n\" - \")","v":45.5},{"$f":"IF(Tabelle_Auswertung[[#This Row],[Bildname]]<>\"\",IF(Tabelle_Auswertung[[#This Row],[Punkte]]>0,AVERAGE(Tabelle_Auswertung[[#This Row],[Juror 1]:[Juror 20]]),\" - \"),\" - \")","v":{"v":6.5,"d":"6.50 "}},{"$f":"IF(Tabelle_Auswertung[[#This Row],[Bildname]]<>\"\",IF(Tabelle_Auswertung[[#This Row],[Punkte]]>0,RANK(Tabelle_Auswertung[[#This Row],[Punkte]],[Punkte],0),\" - \"),\" - \")","v":36},"Andreas Toltz","ja",{"$f":"IF(Tabelle_Auswertung[[#This Row],[Platz]]=1,CONCATENATE(Tabelle_Auswertung[[#This Row],[Bildname]],\" von \",Tabelle_Auswertung[[#This Row],[Autor(in)]]),\"\")","v":""},{"$f":"IF(Tabelle_Auswertung[[#This Row],[Platz]]=2,CONCATENATE(Tabelle_Auswertung[[#This Row],[Bildname]],\" von \",Tabelle_Auswertung[[#This Row],[Autor(in)]]),\"\")","v":""},{"$f":"IF(Tabelle_Auswertung[[#This Row],[Platz]]=3,CONCATENATE(Tabelle_Auswertung[[#This Row],[Bildname]],\" von \",Tabelle_Auswertung[[#This Row],[Autor(in)]]),\"\")","v":""},{"$f":"IF(Tabelle_Auswertung[[#This Row],[Platz]]=4,CONCATENATE(Tabelle_Auswertung[[#This Row],[Bildname]],\" von \",Tabelle_Auswertung[[#This Row],[Autor(in)]]),\"\")","v":""},{"$f":"IF(Tabelle_Auswertung[[#This Row],[Platz]]=5,CONCATENATE(Tabelle_Auswertung[[#This Row],[Bildname]],\" von \",Tabelle_Auswertung[[#This Row],[Autor(in)]]),\"\")","v":""},{"$f":"IF(Tabelle_Auswertung[[#This Row],[Platz]]=6,CONCATENATE(Tabelle_Auswertung[[#This Row],[Bildname]],\" von \",Tabelle_Auswertung[[#This Row],[Autor(in)]]),\"\")","v":""},{"$f":"IF(Tabelle_Auswertung[[#This Row],[Platz]]=7,CONCATENATE(Tabelle_Auswertung[[#This Row],[Bildname]],\" von \",Tabelle_Auswertung[[#This Row],[Autor(in)]]),\"\")","v":""},{"$f":"IF(Tabelle_Auswertung[[#This Row],[Platz]]=8,CONCATENATE(Tabelle_Auswertung[[#This Row],[Bildname]],\" von \",Tabelle_Auswertung[[#This Row],[Autor(in)]]),\"\")","v":""},{"$f":"IF(Tabelle_Auswertung[[#This Row],[Platz]]=9,CONCATENATE(Tabelle_Auswertung[[#This Row],[Bildname]],\" von \",Tabelle_Auswertung[[#This Row],[Autor(in)]]),\"\")","v":""},{"$f":"IF(Tabelle_Auswertung[[#This Row],[Platz]]=10,CONCATENATE(Tabelle_Auswertung[[#This Row],[Bildname]],\" von \",Tabelle_Auswertung[[#This Row],[Autor(in)]]),\"\")","v":""}]
[37,"Ameise.JPG",5,0,6,9,6,8,6,5,{"$nulls":12},{"$f":"IF(Tabelle_Auswertung[[#This Row],[Bildname]]<>\"\",\n    IF(Tabelle_Auswertung[[#This Row],[abwesend]]=\"ja\",\n        SUM(Tabelle_Auswertung[[#This Row],[Juror 1]:[Juror 20]])/COUNT(Tabelle_Auswertung[[#This Row],[Juror 1]:[Juror 20]])*(COUNT(Tabelle_Auswertung[[#This Row],[Juror 1]:[Juror 20]])-1),\n        SUM(Tabelle_Auswertung[[#This Row],[Juror 1]:[Juror 20]])\n    ),\n\" - \")","v":45},{"$f":"IF(Tabelle_Auswertung[[#This Row],[Bildname]]<>\"\",IF(Tabelle_Auswertung[[#This Row],[Punkte]]>0,AVERAGE(Tabelle_Auswertung[[#This Row],[Juror 1]:[Juror 20]]),\" - \"),\" - \")","v":{"v":5.625,"d":"5.63 "}},{"$f":"IF(Tabelle_Auswertung[[#This Row],[Bildname]]<>\"\",IF(Tabelle_Auswertung[[#This Row],[Punkte]]>0,RANK(Tabelle_Auswertung[[#This Row],[Punkte]],[Punkte],0),\" - \"),\" - \")","v":37},"Nadja Cassim",null,{"$f":"IF(Tabelle_Auswertung[[#This Row],[Platz]]=1,CONCATENATE(Tabelle_Auswertung[[#This Row],[Bildname]],\" von \",Tabelle_Auswertung[[#This Row],[Autor(in)]]),\"\")","v":""},{"$f":"IF(Tabelle_Auswertung[[#This Row],[Platz]]=2,CONCATENATE(Tabelle_Auswertung[[#This Row],[Bildname]],\" von \",Tabelle_Auswertung[[#This Row],[Autor(in)]]),\"\")","v":""},{"$f":"IF(Tabelle_Auswertung[[#This Row],[Platz]]=3,CONCATENATE(Tabelle_Auswertung[[#This Row],[Bildname]],\" von \",Tabelle_Auswertung[[#This Row],[Autor(in)]]),\"\")","v":""},{"$f":"IF(Tabelle_Auswertung[[#This Row],[Platz]]=4,CONCATENATE(Tabelle_Auswertung[[#This Row],[Bildname]],\" von \",Tabelle_Auswertung[[#This Row],[Autor(in)]]),\"\")","v":""},{"$f":"IF(Tabelle_Auswertung[[#This Row],[Platz]]=5,CONCATENATE(Tabelle_Auswertung[[#This Row],[Bildname]],\" von \",Tabelle_Auswertung[[#This Row],[Autor(in)]]),\"\")","v":""},{"$f":"IF(Tabelle_Auswertung[[#This Row],[Platz]]=6,CONCATENATE(Tabelle_Auswertung[[#This Row],[Bildname]],\" von \",Tabelle_Auswertung[[#This Row],[Autor(in)]]),\"\")","v":""},{"$f":"IF(Tabelle_Auswertung[[#This Row],[Platz]]=7,CONCATENATE(Tabelle_Auswertung[[#This Row],[Bildname]],\" von \",Tabelle_Auswertung[[#This Row],[Autor(in)]]),\"\")","v":""},{"$f":"IF(Tabelle_Auswertung[[#This Row],[Platz]]=8,CONCATENATE(Tabelle_Auswertung[[#This Row],[Bildname]],\" von \",Tabelle_Auswertung[[#This Row],[Autor(in)]]),\"\")","v":""},{"$f":"IF(Tabelle_Auswertung[[#This Row],[Platz]]=9,CONCATENATE(Tabelle_Auswertung[[#This Row],[Bildname]],\" von \",Tabelle_Auswertung[[#This Row],[Autor(in)]]),\"\")","v":""},{"$f":"IF(Tabelle_Auswertung[[#This Row],[Platz]]=10,CONCATENATE(Tabelle_Auswertung[[#This Row],[Bildname]],\" von \",Tabelle_Auswertung[[#This Row],[Autor(in)]]),\"\")","v":""}]
[38,"ob's schmeckt.JPG",6,8,6,8,5,7,7,4,{"$nulls":12},{"$f":"IF(Tabelle_Auswertung[[#This Row],[Bildname]]<>\"\",\n    IF(Tabelle_Auswertung[[#This Row],[abwesend]]=\"ja\",\n        SUM(Tabelle_Auswertung[[#This Row],[Juror 1]:[Juror 20]])/COUNT(Tabelle_Auswertung[[#This Row],[Juror 1]:[Juror 20]])*(COUNT(Tabelle_Auswertung[[#This Row],[Juror 1]:[Juror 20]])-1),\n        SUM(Tabelle_Auswertung[[#This Row],[Juror 1]:[Juror 20]])\n    ),\n\" - \")","v":44.625},{"$f":"IF(Tabelle_Auswertung[[#This Row],[Bildname]]<>\"\",IF(Tabelle_Auswertung[[#This Row],[Punkte]]>0,AVERAGE(Tabelle_Auswertung[[#This Row],[Juror 1]:[Juror 20]]),\" - \"),\" - \")","v":6.375},{"$f":"IF(Tabelle_Auswertung[[#This Row],[Bildname]]<>\"\",IF(Tabelle_Auswertung[[#This Row],[Punkte]]>0,RANK(Tabelle_Auswertung[[#This Row],[Punkte]],[Punkte],0),\" - \"),\" - \")","v":38},"Susanne Deinhardt","ja",{"$f":"IF(Tabelle_Auswertung[[#This Row],[Platz]]=1,CONCATENATE(Tabelle_Auswertung[[#This Row],[Bildname]],\" von \",Tabelle_Auswertung[[#This Row],[Autor(in)]]),\"\")","v":""},{"$f":"IF(Tabelle_Auswertung[[#This Row],[Platz]]=2,CONCATENATE(Tabelle_Auswertung[[#This Row],[Bildname]],\" von \",Tabelle_Auswertung[[#This Row],[Autor(in)]]),\"\")","v":""},{"$f":"IF(Tabelle_Auswertung[[#This Row],[Platz]]=3,CONCATENATE(Tabelle_Auswertung[[#This Row],[Bildname]],\" von \",Tabelle_Auswertung[[#This Row],[Autor(in)]]),\"\")","v":""},{"$f":"IF(Tabelle_Auswertung[[#This Row],[Platz]]=4,CONCATENATE(Tabelle_Auswertung[[#This Row],[Bildname]],\" von \",Tabelle_Auswertung[[#This Row],[Autor(in)]]),\"\")","v":""},{"$f":"IF(Tabelle_Auswertung[[#This Row],[Platz]]=5,CONCATENATE(Tabelle_Auswertung[[#This Row],[Bildname]],\" von \",Tabelle_Auswertung[[#This Row],[Autor(in)]]),\"\")","v":""},{"$f":"IF(Tabelle_Auswertung[[#This Row],[Platz]]=6,CONCATENATE(Tabelle_Auswertung[[#This Row],[Bildname]],\" von \",Tabelle_Auswertung[[#This Row],[Autor(in)]]),\"\")","v":""},{"$f":"IF(Tabelle_Auswertung[[#This Row],[Platz]]=7,CONCATENATE(Tabelle_Auswertung[[#This Row],[Bildname]],\" von \",Tabelle_Auswertung[[#This Row],[Autor(in)]]),\"\")","v":""},{"$f":"IF(Tabelle_Auswertung[[#This Row],[Platz]]=8,CONCATENATE(Tabelle_Auswertung[[#This Row],[Bildname]],\" von \",Tabelle_Auswertung[[#This Row],[Autor(in)]]),\"\")","v":""},{"$f":"IF(Tabelle_Auswertung[[#This Row],[Platz]]=9,CONCATENATE(Tabelle_Auswertung[[#This Row],[Bildname]],\" von \",Tabelle_Auswertung[[#This Row],[Autor(in)]]),\"\")","v":""},{"$f":"IF(Tabelle_Auswertung[[#This Row],[Platz]]=10,CONCATENATE(Tabelle_Auswertung[[#This Row],[Bildname]],\" von \",Tabelle_Auswertung[[#This Row],[Autor(in)]]),\"\")","v":""}]
[39,"eye.jpg",8,6,5,8,8,4,5,0,{"$nulls":12},{"$f":"IF(Tabelle_Auswertung[[#This Row],[Bildname]]<>\"\",\n    IF(Tabelle_Auswertung[[#This Row],[abwesend]]=\"ja\",\n        SUM(Tabelle_Auswertung[[#This Row],[Juror 1]:[Juror 20]])/COUNT(Tabelle_Auswertung[[#This Row],[Juror 1]:[Juror 20]])*(COUNT(Tabelle_Auswertung[[#This Row],[Juror 1]:[Juror 20]])-1),\n        SUM(Tabelle_Auswertung[[#This Row],[Juror 1]:[Juror 20]])\n    ),\n\" - \")","v":44},{"$f":"IF(Tabelle_Auswertung[[#This Row],[Bildname]]<>\"\",IF(Tabelle_Auswertung[[#This Row],[Punkte]]>0,AVERAGE(Tabelle_Auswertung[[#This Row],[Juror 1]:[Juror 20]]),\" - \"),\" - \")","v":{"v":5.5,"d":"5.50 "}},{"$f":"IF(Tabelle_Auswertung[[#This Row],[Bildname]]<>\"\",IF(Tabelle_Auswertung[[#This Row],[Punkte]]>0,RANK(Tabelle_Auswertung[[#This Row],[Punkte]],[Punkte],0),\" - \"),\" - \")","v":39},"Gerhard Rieß",null,{"$f":"IF(Tabelle_Auswertung[[#This Row],[Platz]]=1,CONCATENATE(Tabelle_Auswertung[[#This Row],[Bildname]],\" von \",Tabelle_Auswertung[[#This Row],[Autor(in)]]),\"\")","v":""},{"$f":"IF(Tabelle_Auswertung[[#This Row],[Platz]]=2,CONCATENATE(Tabelle_Auswertung[[#This Row],[Bildname]],\" von \",Tabelle_Auswertung[[#This Row],[Autor(in)]]),\"\")","v":""},{"$f":"IF(Tabelle_Auswertung[[#This Row],[Platz]]=3,CONCATENATE(Tabelle_Auswertung[[#This Row],[Bildname]],\" von \",Tabelle_Auswertung[[#This Row],[Autor(in)]]),\"\")","v":""},{"$f":"IF(Tabelle_Auswertung[[#This Row],[Platz]]=4,CONCATENATE(Tabelle_Auswertung[[#This Row],[Bildname]],\" von \",Tabelle_Auswertung[[#This Row],[Autor(in)]]),\"\")","v":""},{"$f":"IF(Tabelle_Auswertung[[#This Row],[Platz]]=5,CONCATENATE(Tabelle_Auswertung[[#This Row],[Bildname]],\" von \",Tabelle_Auswertung[[#This Row],[Autor(in)]]),\"\")","v":""},{"$f":"IF(Tabelle_Auswertung[[#This Row],[Platz]]=6,CONCATENATE(Tabelle_Auswertung[[#This Row],[Bildname]],\" von \",Tabelle_Auswertung[[#This Row],[Autor(in)]]),\"\")","v":""},{"$f":"IF(Tabelle_Auswertung[[#This Row],[Platz]]=7,CONCATENATE(Tabelle_Auswertung[[#This Row],[Bildname]],\" von \",Tabelle_Auswertung[[#This Row],[Autor(in)]]),\"\")","v":""},{"$f":"IF(Tabelle_Auswertung[[#This Row],[Platz]]=8,CONCATENATE(Tabelle_Auswertung[[#This Row],[Bildname]],\" von \",Tabelle_Auswertung[[#This Row],[Autor(in)]]),\"\")","v":""},{"$f":"IF(Tabelle_Auswertung[[#This Row],[Platz]]=9,CONCATENATE(Tabelle_Auswertung[[#This Row],[Bildname]],\" von \",Tabelle_Auswertung[[#This Row],[Autor(in)]]),\"\")","v":""},{"$f":"IF(Tabelle_Auswertung[[#This Row],[Platz]]=10,CONCATENATE(Tabelle_Auswertung[[#This Row],[Bildname]],\" von \",Tabelle_Auswertung[[#This Row],[Autor(in)]]),\"\")","v":""}]
[40,"Moschee.jpg",7,8,5,9,7,0,4,4,{"$nulls":12},{"$f":"IF(Tabelle_Auswertung[[#This Row],[Bildname]]<>\"\",\n    IF(Tabelle_Auswertung[[#This Row],[abwesend]]=\"ja\",\n        SUM(Tabelle_Auswertung[[#This Row],[Juror 1]:[Juror 20]])/COUNT(Tabelle_Auswertung[[#This Row],[Juror 1]:[Juror 20]])*(COUNT(Tabelle_Auswertung[[#This Row],[Juror 1]:[Juror 20]])-1),\n        SUM(Tabelle_Auswertung[[#This Row],[Juror 1]:[Juror 20]])\n    ),\n\" - \")","v":44},{"$f":"IF(Tabelle_Auswertung[[#This Row],[Bildname]]<>\"\",IF(Tabelle_Auswertung[[#This Row],[Punkte]]>0,AVERAGE(Tabelle_Auswertung[[#This Row],[Juror 1]:[Juror 20]]),\" - \"),\" - \")","v":{"v":5.5,"d":"5.50 "}},{"$f":"IF(Tabelle_Auswertung[[#This Row],[Bildname]]<>\"\",IF(Tabelle_Auswertung[[#This Row],[Punkte]]>0,RANK(Tabelle_Auswertung[[#This Row],[Punkte]],[Punkte],0),\" - \"),\" - \")","v":39},"Antje Finsterer",null,{"$f":"IF(Tabelle_Auswertung[[#This Row],[Platz]]=1,CONCATENATE(Tabelle_Auswertung[[#This Row],[Bildname]],\" von \",Tabelle_Auswertung[[#This Row],[Autor(in)]]),\"\")","v":""},{"$f":"IF(Tabelle_Auswertung[[#This Row],[Platz]]=2,CONCATENATE(Tabelle_Auswertung[[#This Row],[Bildname]],\" von \",Tabelle_Auswertung[[#This Row],[Autor(in)]]),\"\")","v":""},{"$f":"IF(Tabelle_Auswertung[[#This Row],[Platz]]=3,CONCATENATE(Tabelle_Auswertung[[#This Row],[Bildname]],\" von \",Tabelle_Auswertung[[#This Row],[Autor(in)]]),\"\")","v":""},{"$f":"IF(Tabelle_Auswertung[[#This Row],[Platz]]=4,CONCATENATE(Tabelle_Auswertung[[#This Row],[Bildname]],\" von \",Tabelle_Auswertung[[#This Row],[Autor(in)]]),\"\")","v":""},{"$f":"IF(Tabelle_Auswertung[[#This Row],[Platz]]=5,CONCATENATE(Tabelle_Auswertung[[#This Row],[Bildname]],\" von \",Tabelle_Auswertung[[#This Row],[Autor(in)]]),\"\")","v":""},{"$f":"IF(Tabelle_Auswertung[[#This Row],[Platz]]=6,CONCATENATE(Tabelle_Auswertung[[#This Row],[Bildname]],\" von \",Tabelle_Auswertung[[#This Row],[Autor(in)]]),\"\")","v":""},{"$f":"IF(Tabelle_Auswertung[[#This Row],[Platz]]=7,CONCATENATE(Tabelle_Auswertung[[#This Row],[Bildname]],\" von \",Tabelle_Auswertung[[#This Row],[Autor(in)]]),\"\")","v":""},{"$f":"IF(Tabelle_Auswertung[[#This Row],[Platz]]=8,CONCATENATE(Tabelle_Auswertung[[#This Row],[Bildname]],\" von \",Tabelle_Auswertung[[#This Row],[Autor(in)]]),\"\")","v":""},{"$f":"IF(Tabelle_Auswertung[[#This Row],[Platz]]=9,CONCATENATE(Tabelle_Auswertung[[#This Row],[Bildname]],\" von \",Tabelle_Auswertung[[#This Row],[Autor(in)]]),\"\")","v":""},{"$f":"IF(Tabelle_Auswertung[[#This Row],[Platz]]=10,CONCATENATE(Tabelle_Auswertung[[#This Row],[Bildname]],\" von \",Tabelle_Auswertung[[#This Row],[Autor(in)]]),\"\")","v":""}]
[41,"Nasal.JPG",7,8,0,7,6,5,7,4,{"$nulls":12},{"$f":"IF(Tabelle_Auswertung[[#This Row],[Bildname]]<>\"\",\n    IF(Tabelle_Auswertung[[#This Row],[abwesend]]=\"ja\",\n        SUM(Tabelle_Auswertung[[#This Row],[Juror 1]:[Juror 20]])/COUNT(Tabelle_Auswertung[[#This Row],[Juror 1]:[Juror 20]])*(COUNT(Tabelle_Auswertung[[#This Row],[Juror 1]:[Juror 20]])-1),\n        SUM(Tabelle_Auswertung[[#This Row],[Juror 1]:[Juror 20]])\n    ),\n\" - \")","v":44},{"$f":"IF(Tabelle_Auswertung[[#This Row],[Bildname]]<>\"\",IF(Tabelle_Auswertung[[#This Row],[Punkte]]>0,AVERAGE(Tabelle_Auswertung[[#This Row],[Juror 1]:[Juror 20]]),\" - \"),\" - \")","v":{"v":5.5,"d":"5.50 "}},{"$f":"IF(Tabelle_Auswertung[[#This Row],[Bildname]]<>\"\",IF(Tabelle_Auswertung[[#This Row],[Punkte]]>0,RANK(Tabelle_Auswertung[[#This Row],[Punkte]],[Punkte],0),\" - \"),\" - \")","v":39},"Albrecht Flierl",null,{"$f":"IF(Tabelle_Auswertung[[#This Row],[Platz]]=1,CONCATENATE(Tabelle_Auswertung[[#This Row],[Bildname]],\" von \",Tabelle_Auswertung[[#This Row],[Autor(in)]]),\"\")","v":""},{"$f":"IF(Tabelle_Auswertung[[#This Row],[Platz]]=2,CONCATENATE(Tabelle_Auswertung[[#This Row],[Bildname]],\" von \",Tabelle_Auswertung[[#This Row],[Autor(in)]]),\"\")","v":""},{"$f":"IF(Tabelle_Auswertung[[#This Row],[Platz]]=3,CONCATENATE(Tabelle_Auswertung[[#This Row],[Bildname]],\" von \",Tabelle_Auswertung[[#This Row],[Autor(in)]]),\"\")","v":""},{"$f":"IF(Tabelle_Auswertung[[#This Row],[Platz]]=4,CONCATENATE(Tabelle_Auswertung[[#This Row],[Bildname]],\" von \",Tabelle_Auswertung[[#This Row],[Autor(in)]]),\"\")","v":""},{"$f":"IF(Tabelle_Auswertung[[#This Row],[Platz]]=5,CONCATENATE(Tabelle_Auswertung[[#This Row],[Bildname]],\" von \",Tabelle_Auswertung[[#This Row],[Autor(in)]]),\"\")","v":""},{"$f":"IF(Tabelle_Auswertung[[#This Row],[Platz]]=6,CONCATENATE(Tabelle_Auswertung[[#This Row],[Bildname]],\" von \",Tabelle_Auswertung[[#This Row],[Autor(in)]]),\"\")","v":""},{"$f":"IF(Tabelle_Auswertung[[#This Row],[Platz]]=7,CONCATENATE(Tabelle_Auswertung[[#This Row],[Bildname]],\" von \",Tabelle_Auswertung[[#This Row],[Autor(in)]]),\"\")","v":""},{"$f":"IF(Tabelle_Auswertung[[#This Row],[Platz]]=8,CONCATENATE(Tabelle_Auswertung[[#This Row],[Bildname]],\" von \",Tabelle_Auswertung[[#This Row],[Autor(in)]]),\"\")","v":""},{"$f":"IF(Tabelle_Auswertung[[#This Row],[Platz]]=9,CONCATENATE(Tabelle_Auswertung[[#This Row],[Bildname]],\" von \",Tabelle_Auswertung[[#This Row],[Autor(in)]]),\"\")","v":""},{"$f":"IF(Tabelle_Auswertung[[#This Row],[Platz]]=10,CONCATENATE(Tabelle_Auswertung[[#This Row],[Bildname]],\" von \",Tabelle_Auswertung[[#This Row],[Autor(in)]]),\"\")","v":""}]
[42,"Sunset.jpg",7,8,4,9,5,6,0,5,{"$nulls":12},{"$f":"IF(Tabelle_Auswertung[[#This Row],[Bildname]]<>\"\",\n    IF(Tabelle_Auswertung[[#This Row],[abwesend]]=\"ja\",\n        SUM(Tabelle_Auswertung[[#This Row],[Juror 1]:[Juror 20]])/COUNT(Tabelle_Auswertung[[#This Row],[Juror 1]:[Juror 20]])*(COUNT(Tabelle_Auswertung[[#This Row],[Juror 1]:[Juror 20]])-1),\n        SUM(Tabelle_Auswertung[[#This Row],[Juror 1]:[Juror 20]])\n    ),\n\" - \")","v":44},{"$f":"IF(Tabelle_Auswertung[[#This Row],[Bildname]]<>\"\",IF(Tabelle_Auswertung[[#This Row],[Punkte]]>0,AVERAGE(Tabelle_Auswertung[[#This Row],[Juror 1]:[Juror 20]]),\" - \"),\" - \")","v":5.5},{"$f":"IF(Tabelle_Auswertung[[#This Row],[Bildname]]<>\"\",IF(Tabelle_Auswertung[[#This Row],[Punkte]]>0,RANK(Tabelle_Auswertung[[#This Row],[Punkte]],[Punkte],0),\" - \"),\" - \")","v":39},"Oliver von Guérard",null,{"$f":"IF(Tabelle_Auswertung[[#This Row],[Platz]]=1,CONCATENATE(Tabelle_Auswertung[[#This Row],[Bildname]],\" von \",Tabelle_Auswertung[[#This Row],[Autor(in)]]),\"\")","v":""},{"$f":"IF(Tabelle_Auswertung[[#This Row],[Platz]]=2,CONCATENATE(Tabelle_Auswertung[[#This Row],[Bildname]],\" von \",Tabelle_Auswertung[[#This Row],[Autor(in)]]),\"\")","v":""},{"$f":"IF(Tabelle_Auswertung[[#This Row],[Platz]]=3,CONCATENATE(Tabelle_Auswertung[[#This Row],[Bildname]],\" von \",Tabelle_Auswertung[[#This Row],[Autor(in)]]),\"\")","v":""},{"$f":"IF(Tabelle_Auswertung[[#This Row],[Platz]]=4,CONCATENATE(Tabelle_Auswertung[[#This Row],[Bildname]],\" von \",Tabelle_Auswertung[[#This Row],[Autor(in)]]),\"\")","v":""},{"$f":"IF(Tabelle_Auswertung[[#This Row],[Platz]]=5,CONCATENATE(Tabelle_Auswertung[[#This Row],[Bildname]],\" von \",Tabelle_Auswertung[[#This Row],[Autor(in)]]),\"\")","v":""},{"$f":"IF(Tabelle_Auswertung[[#This Row],[Platz]]=6,CONCATENATE(Tabelle_Auswertung[[#This Row],[Bildname]],\" von \",Tabelle_Auswertung[[#This Row],[Autor(in)]]),\"\")","v":""},{"$f":"IF(Tabelle_Auswertung[[#This Row],[Platz]]=7,CONCATENATE(Tabelle_Auswertung[[#This Row],[Bildname]],\" von \",Tabelle_Auswertung[[#This Row],[Autor(in)]]),\"\")","v":""},{"$f":"IF(Tabelle_Auswertung[[#This Row],[Platz]]=8,CONCATENATE(Tabelle_Auswertung[[#This Row],[Bildname]],\" von \",Tabelle_Auswertung[[#This Row],[Autor(in)]]),\"\")","v":""},{"$f":"IF(Tabelle_Auswertung[[#This Row],[Platz]]=9,CONCATENATE(Tabelle_Auswertung[[#This Row],[Bildname]],\" von \",Tabelle_Auswertung[[#This Row],[Autor(in)]]),\"\")","v":""},{"$f":"IF(Tabelle_Auswertung[[#This Row],[Platz]]=10,CONCATENATE(Tabelle_Auswertung[[#This Row],[Bildname]],\" von \",Tabelle_Auswertung[[#This Row],[Autor(in)]]),\"\")","v":""}]
[43,"Butterfly.JPG",0,5,4,9,6,6,7,6,{"$nulls":12},{"$f":"IF(Tabelle_Auswertung[[#This Row],[Bildname]]<>\"\",\n    IF(Tabelle_Auswertung[[#This Row],[abwesend]]=\"ja\",\n        SUM(Tabelle_Auswertung[[#This Row],[Juror 1]:[Juror 20]])/COUNT(Tabelle_Auswertung[[#This Row],[Juror 1]:[Juror 20]])*(COUNT(Tabelle_Auswertung[[#This Row],[Juror 1]:[Juror 20]])-1),\n        SUM(Tabelle_Auswertung[[#This Row],[Juror 1]:[Juror 20]])\n    ),\n\" - \")","v":43},{"$f":"IF(Tabelle_Auswertung[[#This Row],[Bildname]]<>\"\",IF(Tabelle_Auswertung[[#This Row],[Punkte]]>0,AVERAGE(Tabelle_Auswertung[[#This Row],[Juror 1]:[Juror 20]]),\" - \"),\" - \")","v":5.375},{"$f":"IF(Tabelle_Auswertung[[#This Row],[Bildname]]<>\"\",IF(Tabelle_Auswertung[[#This Row],[Punkte]]>0,RANK(Tabelle_Auswertung[[#This Row],[Punkte]],[Punkte],0),\" - \"),\" - \")","v":43},"Claudia Dommel",null,{"$f":"IF(Tabelle_Auswertung[[#This Row],[Platz]]=1,CONCATENATE(Tabelle_Auswertung[[#This Row],[Bildname]],\" von \",Tabelle_Auswertung[[#This Row],[Autor(in)]]),\"\")","v":""},{"$f":"IF(Tabelle_Auswertung[[#This Row],[Platz]]=2,CONCATENATE(Tabelle_Auswertung[[#This Row],[Bildname]],\" von \",Tabelle_Auswertung[[#This Row],[Autor(in)]]),\"\")","v":""},{"$f":"IF(Tabelle_Auswertung[[#This Row],[Platz]]=3,CONCATENATE(Tabelle_Auswertung[[#This Row],[Bildname]],\" von \",Tabelle_Auswertung[[#This Row],[Autor(in)]]),\"\")","v":""},{"$f":"IF(Tabelle_Auswertung[[#This Row],[Platz]]=4,CONCATENATE(Tabelle_Auswertung[[#This Row],[Bildname]],\" von \",Tabelle_Auswertung[[#This Row],[Autor(in)]]),\"\")","v":""},{"$f":"IF(Tabelle_Auswertung[[#This Row],[Platz]]=5,CONCATENATE(Tabelle_Auswertung[[#This Row],[Bildname]],\" von \",Tabelle_Auswertung[[#This Row],[Autor(in)]]),\"\")","v":""},{"$f":"IF(Tabelle_Auswertung[[#This Row],[Platz]]=6,CONCATENATE(Tabelle_Auswertung[[#This Row],[Bildname]],\" von \",Tabelle_Auswertung[[#This Row],[Autor(in)]]),\"\")","v":""},{"$f":"IF(Tabelle_Auswertung[[#This Row],[Platz]]=7,CONCATENATE(Tabelle_Auswertung[[#This Row],[Bildname]],\" von \",Tabelle_Auswertung[[#This Row],[Autor(in)]]),\"\")","v":""},{"$f":"IF(Tabelle_Auswertung[[#This Row],[Platz]]=8,CONCATENATE(Tabelle_Auswertung[[#This Row],[Bildname]],\" von \",Tabelle_Auswertung[[#This Row],[Autor(in)]]),\"\")","v":""},{"$f":"IF(Tabelle_Auswertung[[#This Row],[Platz]]=9,CONCATENATE(Tabelle_Auswertung[[#This Row],[Bildname]],\" von \",Tabelle_Auswertung[[#This Row],[Autor(in)]]),\"\")","v":""},{"$f":"IF(Tabelle_Auswertung[[#This Row],[Platz]]=10,CONCATENATE(Tabelle_Auswertung[[#This Row],[Bildname]],\" von \",Tabelle_Auswertung[[#This Row],[Autor(in)]]),\"\")","v":""}]
[44,"Kampf der Titanen.jpg",8,7,6,7,6,0,4,5,{"$nulls":12},{"$f":"IF(Tabelle_Auswertung[[#This Row],[Bildname]]<>\"\",\n    IF(Tabelle_Auswertung[[#This Row],[abwesend]]=\"ja\",\n        SUM(Tabelle_Auswertung[[#This Row],[Juror 1]:[Juror 20]])/COUNT(Tabelle_Auswertung[[#This Row],[Juror 1]:[Juror 20]])*(COUNT(Tabelle_Auswertung[[#This Row],[Juror 1]:[Juror 20]])-1),\n        SUM(Tabelle_Auswertung[[#This Row],[Juror 1]:[Juror 20]])\n    ),\n\" - \")","v":43},{"$f":"IF(Tabelle_Auswertung[[#This Row],[Bildname]]<>\"\",IF(Tabelle_Auswertung[[#This Row],[Punkte]]>0,AVERAGE(Tabelle_Auswertung[[#This Row],[Juror 1]:[Juror 20]]),\" - \"),\" - \")","v":5.375},{"$f":"IF(Tabelle_Auswertung[[#This Row],[Bildname]]<>\"\",IF(Tabelle_Auswertung[[#This Row],[Punkte]]>0,RANK(Tabelle_Auswertung[[#This Row],[Punkte]],[Punkte],0),\" - \"),\" - \")","v":43},"Antje Finsterer",null,{"$f":"IF(Tabelle_Auswertung[[#This Row],[Platz]]=1,CONCATENATE(Tabelle_Auswertung[[#This Row],[Bildname]],\" von \",Tabelle_Auswertung[[#This Row],[Autor(in)]]),\"\")","v":""},{"$f":"IF(Tabelle_Auswertung[[#This Row],[Platz]]=2,CONCATENATE(Tabelle_Auswertung[[#This Row],[Bildname]],\" von \",Tabelle_Auswertung[[#This Row],[Autor(in)]]),\"\")","v":""},{"$f":"IF(Tabelle_Auswertung[[#This Row],[Platz]]=3,CONCATENATE(Tabelle_Auswertung[[#This Row],[Bildname]],\" von \",Tabelle_Auswertung[[#This Row],[Autor(in)]]),\"\")","v":""},{"$f":"IF(Tabelle_Auswertung[[#This Row],[Platz]]=4,CONCATENATE(Tabelle_Auswertung[[#This Row],[Bildname]],\" von \",Tabelle_Auswertung[[#This Row],[Autor(in)]]),\"\")","v":""},{"$f":"IF(Tabelle_Auswertung[[#This Row],[Platz]]=5,CONCATENATE(Tabelle_Auswertung[[#This Row],[Bildname]],\" von \",Tabelle_Auswertung[[#This Row],[Autor(in)]]),\"\")","v":""},{"$f":"IF(Tabelle_Auswertung[[#This Row],[Platz]]=6,CONCATENATE(Tabelle_Auswertung[[#This Row],[Bildname]],\" von \",Tabelle_Auswertung[[#This Row],[Autor(in)]]),\"\")","v":""},{"$f":"IF(Tabelle_Auswertung[[#This Row],[Platz]]=7,CONCATENATE(Tabelle_Auswertung[[#This Row],[Bildname]],\" von \",Tabelle_Auswertung[[#This Row],[Autor(in)]]),\"\")","v":""},{"$f":"IF(Tabelle_Auswertung[[#This Row],[Platz]]=8,CONCATENATE(Tabelle_Auswertung[[#This Row],[Bildname]],\" von \",Tabelle_Auswertung[[#This Row],[Autor(in)]]),\"\")","v":""},{"$f":"IF(Tabelle_Auswertung[[#This Row],[Platz]]=9,CONCATENATE(Tabelle_Auswertung[[#This Row],[Bildname]],\" von \",Tabelle_Auswertung[[#This Row],[Autor(in)]]),\"\")","v":""},{"$f":"IF(Tabelle_Auswertung[[#This Row],[Platz]]=10,CONCATENATE(Tabelle_Auswertung[[#This Row],[Bildname]],\" von \",Tabelle_Auswertung[[#This Row],[Autor(in)]]),\"\")","v":""}]
[45,"Piano.JPG",5,8,0,4,6,7,8,5,{"$nulls":12},{"$f":"IF(Tabelle_Auswertung[[#This Row],[Bildname]]<>\"\",\n    IF(Tabelle_Auswertung[[#This Row],[abwesend]]=\"ja\",\n        SUM(Tabelle_Auswertung[[#This Row],[Juror 1]:[Juror 20]])/COUNT(Tabelle_Auswertung[[#This Row],[Juror 1]:[Juror 20]])*(COUNT(Tabelle_Auswertung[[#This Row],[Juror 1]:[Juror 20]])-1),\n        SUM(Tabelle_Auswertung[[#This Row],[Juror 1]:[Juror 20]])\n    ),\n\" - \")","v":43},{"$f":"IF(Tabelle_Auswertung[[#This Row],[Bildname]]<>\"\",IF(Tabelle_Auswertung[[#This Row],[Punkte]]>0,AVERAGE(Tabelle_Auswertung[[#This Row],[Juror 1]:[Juror 20]]),\" - \"),\" - \")","v":{"v":5.375,"d":"5.38 "}},{"$f":"IF(Tabelle_Auswertung[[#This Row],[Bildname]]<>\"\",IF(Tabelle_Auswertung[[#This Row],[Punkte]]>0,RANK(Tabelle_Auswertung[[#This Row],[Punkte]],[Punkte],0),\" - \"),\" - \")","v":43},"Albrecht Flierl",null,{"$f":"IF(Tabelle_Auswertung[[#This Row],[Platz]]=1,CONCATENATE(Tabelle_Auswertung[[#This Row],[Bildname]],\" von \",Tabelle_Auswertung[[#This Row],[Autor(in)]]),\"\")","v":""},{"$f":"IF(Tabelle_Auswertung[[#This Row],[Platz]]=2,CONCATENATE(Tabelle_Auswertung[[#This Row],[Bildname]],\" von \",Tabelle_Auswertung[[#This Row],[Autor(in)]]),\"\")","v":""},{"$f":"IF(Tabelle_Auswertung[[#This Row],[Platz]]=3,CONCATENATE(Tabelle_Auswertung[[#This Row],[Bildname]],\" von \",Tabelle_Auswertung[[#This Row],[Autor(in)]]),\"\")","v":""},{"$f":"IF(Tabelle_Auswertung[[#This Row],[Platz]]=4,CONCATENATE(Tabelle_Auswertung[[#This Row],[Bildname]],\" von \",Tabelle_Auswertung[[#This Row],[Autor(in)]]),\"\")","v":""},{"$f":"IF(Tabelle_Auswertung[[#This Row],[Platz]]=5,CONCATENATE(Tabelle_Auswertung[[#This Row],[Bildname]],\" von \",Tabelle_Auswertung[[#This Row],[Autor(in)]]),\"\")","v":""},{"$f":"IF(Tabelle_Auswertung[[#This Row],[Platz]]=6,CONCATENATE(Tabelle_Auswertung[[#This Row],[Bildname]],\" von \",Tabelle_Auswertung[[#This Row],[Autor(in)]]),\"\")","v":""},{"$f":"IF(Tabelle_Auswertung[[#This Row],[Platz]]=7,CONCATENATE(Tabelle_Auswertung[[#This Row],[Bildname]],\" von \",Tabelle_Auswertung[[#This Row],[Autor(in)]]),\"\")","v":""},{"$f":"IF(Tabelle_Auswertung[[#This Row],[Platz]]=8,CONCATENATE(Tabelle_Auswertung[[#This Row],[Bildname]],\" von \",Tabelle_Auswertung[[#This Row],[Autor(in)]]),\"\")","v":""},{"$f":"IF(Tabelle_Auswertung[[#This Row],[Platz]]=9,CONCATENATE(Tabelle_Auswertung[[#This Row],[Bildname]],\" von \",Tabelle_Auswertung[[#This Row],[Autor(in)]]),\"\")","v":""},{"$f":"IF(Tabelle_Auswertung[[#This Row],[Platz]]=10,CONCATENATE(Tabelle_Auswertung[[#This Row],[Bildname]],\" von \",Tabelle_Auswertung[[#This Row],[Autor(in)]]),\"\")","v":""}]
[46,"WindyWedding.jpg",6,7,7,7,5,0,5,6,{"$nulls":12},{"$f":"IF(Tabelle_Auswertung[[#This Row],[Bildname]]<>\"\",\n    IF(Tabelle_Auswertung[[#This Row],[abwesend]]=\"ja\",\n        SUM(Tabelle_Auswertung[[#This Row],[Juror 1]:[Juror 20]])/COUNT(Tabelle_Auswertung[[#This Row],[Juror 1]:[Juror 20]])*(COUNT(Tabelle_Auswertung[[#This Row],[Juror 1]:[Juror 20]])-1),\n        SUM(Tabelle_Auswertung[[#This Row],[Juror 1]:[Juror 20]])\n    ),\n\" - \")","v":43},{"$f":"IF(Tabelle_Auswertung[[#This Row],[Bildname]]<>\"\",IF(Tabelle_Auswertung[[#This Row],[Punkte]]>0,AVERAGE(Tabelle_Auswertung[[#This Row],[Juror 1]:[Juror 20]]),\" - \"),\" - \")","v":{"v":5.375,"d":"5.38 "}},{"$f":"IF(Tabelle_Auswertung[[#This Row],[Bildname]]<>\"\",IF(Tabelle_Auswertung[[#This Row],[Punkte]]>0,RANK(Tabelle_Auswertung[[#This Row],[Punkte]],[Punkte],0),\" - \"),\" - \")","v":43},"Antje Finsterer",null,{"$f":"IF(Tabelle_Auswertung[[#This Row],[Platz]]=1,CONCATENATE(Tabelle_Auswertung[[#This Row],[Bildname]],\" von \",Tabelle_Auswertung[[#This Row],[Autor(in)]]),\"\")","v":""},{"$f":"IF(Tabelle_Auswertung[[#This Row],[Platz]]=2,CONCATENATE(Tabelle_Auswertung[[#This Row],[Bildname]],\" von \",Tabelle_Auswertung[[#This Row],[Autor(in)]]),\"\")","v":""},{"$f":"IF(Tabelle_Auswertung[[#This Row],[Platz]]=3,CONCATENATE(Tabelle_Auswertung[[#This Row],[Bildname]],\" von \",Tabelle_Auswertung[[#This Row],[Autor(in)]]),\"\")","v":""},{"$f":"IF(Tabelle_Auswertung[[#This Row],[Platz]]=4,CONCATENATE(Tabelle_Auswertung[[#This Row],[Bildname]],\" von \",Tabelle_Auswertung[[#This Row],[Autor(in)]]),\"\")","v":""},{"$f":"IF(Tabelle_Auswertung[[#This Row],[Platz]]=5,CONCATENATE(Tabelle_Auswertung[[#This Row],[Bildname]],\" von \",Tabelle_Auswertung[[#This Row],[Autor(in)]]),\"\")","v":""},{"$f":"IF(Tabelle_Auswertung[[#This Row],[Platz]]=6,CONCATENATE(Tabelle_Auswertung[[#This Row],[Bildname]],\" von \",Tabelle_Auswertung[[#This Row],[Autor(in)]]),\"\")","v":""},{"$f":"IF(Tabelle_Auswertung[[#This Row],[Platz]]=7,CONCATENATE(Tabelle_Auswertung[[#This Row],[Bildname]],\" von \",Tabelle_Auswertung[[#This Row],[Autor(in)]]),\"\")","v":""},{"$f":"IF(Tabelle_Auswertung[[#This Row],[Platz]]=8,CONCATENATE(Tabelle_Auswertung[[#This Row],[Bildname]],\" von \",Tabelle_Auswertung[[#This Row],[Autor(in)]]),\"\")","v":""},{"$f":"IF(Tabelle_Auswertung[[#This Row],[Platz]]=9,CONCATENATE(Tabelle_Auswertung[[#This Row],[Bildname]],\" von \",Tabelle_Auswertung[[#This Row],[Autor(in)]]),\"\")","v":""},{"$f":"IF(Tabelle_Auswertung[[#This Row],[Platz]]=10,CONCATENATE(Tabelle_Auswertung[[#This Row],[Bildname]],\" von \",Tabelle_Auswertung[[#This Row],[Autor(in)]]),\"\")","v":""}]
[47,"Angriff.jpg",8,5,5,9,7,0,4,4,{"$nulls":12},{"$f":"IF(Tabelle_Auswertung[[#This Row],[Bildname]]<>\"\",\n    IF(Tabelle_Auswertung[[#This Row],[abwesend]]=\"ja\",\n        SUM(Tabelle_Auswertung[[#This Row],[Juror 1]:[Juror 20]])/COUNT(Tabelle_Auswertung[[#This Row],[Juror 1]:[Juror 20]])*(COUNT(Tabelle_Auswertung[[#This Row],[Juror 1]:[Juror 20]])-1),\n        SUM(Tabelle_Auswertung[[#This Row],[Juror 1]:[Juror 20]])\n    ),\n\" - \")","v":42},{"$f":"IF(Tabelle_Auswertung[[#This Row],[Bildname]]<>\"\",IF(Tabelle_Auswertung[[#This Row],[Punkte]]>0,AVERAGE(Tabelle_Auswertung[[#This Row],[Juror 1]:[Juror 20]]),\" - \"),\" - \")","v":{"v":5.25,"d":"5.25 "}},{"$f":"IF(Tabelle_Auswertung[[#This Row],[Bildname]]<>\"\",IF(Tabelle_Auswertung[[#This Row],[Punkte]]>0,RANK(Tabelle_Auswertung[[#This Row],[Punkte]],[Punkte],0),\" - \"),\" - \")","v":47},"Antje Finsterer",null,{"$f":"IF(Tabelle_Auswertung[[#This Row],[Platz]]=1,CONCATENATE(Tabelle_Auswertung[[#This Row],[Bildname]],\" von \",Tabelle_Auswertung[[#This Row],[Autor(in)]]),\"\")","v":""},{"$f":"IF(Tabelle_Auswertung[[#This Row],[Platz]]=2,CONCATENATE(Tabelle_Auswertung[[#This Row],[Bildname]],\" von \",Tabelle_Auswertung[[#This Row],[Autor(in)]]),\"\")","v":""},{"$f":"IF(Tabelle_Auswertung[[#This Row],[Platz]]=3,CONCATENATE(Tabelle_Auswertung[[#This Row],[Bildname]],\" von \",Tabelle_Auswertung[[#This Row],[Autor(in)]]),\"\")","v":""},{"$f":"IF(Tabelle_Auswertung[[#This Row],[Platz]]=4,CONCATENATE(Tabelle_Auswertung[[#This Row],[Bildname]],\" von \",Tabelle_Auswertung[[#This Row],[Autor(in)]]),\"\")","v":""},{"$f":"IF(Tabelle_Auswertung[[#This Row],[Platz]]=5,CONCATENATE(Tabelle_Auswertung[[#This Row],[Bildname]],\" von \",Tabelle_Auswertung[[#This Row],[Autor(in)]]),\"\")","v":""},{"$f":"IF(Tabelle_Auswertung[[#This Row],[Platz]]=6,CONCATENATE(Tabelle_Auswertung[[#This Row],[Bildname]],\" von \",Tabelle_Auswertung[[#This Row],[Autor(in)]]),\"\")","v":""},{"$f":"IF(Tabelle_Auswertung[[#This Row],[Platz]]=7,CONCATENATE(Tabelle_Auswertung[[#This Row],[Bildname]],\" von \",Tabelle_Auswertung[[#This Row],[Autor(in)]]),\"\")","v":""},{"$f":"IF(Tabelle_Auswertung[[#This Row],[Platz]]=8,CONCATENATE(Tabelle_Auswertung[[#This Row],[Bildname]],\" von \",Tabelle_Auswertung[[#This Row],[Autor(in)]]),\"\")","v":""},{"$f":"IF(Tabelle_Auswertung[[#This Row],[Platz]]=9,CONCATENATE(Tabelle_Auswertung[[#This Row],[Bildname]],\" von \",Tabelle_Auswertung[[#This Row],[Autor(in)]]),\"\")","v":""},{"$f":"IF(Tabelle_Auswertung[[#This Row],[Platz]]=10,CONCATENATE(Tabelle_Auswertung[[#This Row],[Bildname]],\" von \",Tabelle_Auswertung[[#This Row],[Autor(in)]]),\"\")","v":""}]
[48,"Spiegelung.JPG",0,6,7,8,7,3,7,4,{"$nulls":12},{"$f":"IF(Tabelle_Auswertung[[#This Row],[Bildname]]<>\"\",\n    IF(Tabelle_Auswertung[[#This Row],[abwesend]]=\"ja\",\n        SUM(Tabelle_Auswertung[[#This Row],[Juror 1]:[Juror 20]])/COUNT(Tabelle_Auswertung[[#This Row],[Juror 1]:[Juror 20]])*(COUNT(Tabelle_Auswertung[[#This Row],[Juror 1]:[Juror 20]])-1),\n        SUM(Tabelle_Auswertung[[#This Row],[Juror 1]:[Juror 20]])\n    ),\n\" - \")","v":42},{"$f":"IF(Tabelle_Auswertung[[#This Row],[Bildname]]<>\"\",IF(Tabelle_Auswertung[[#This Row],[Punkte]]>0,AVERAGE(Tabelle_Auswertung[[#This Row],[Juror 1]:[Juror 20]]),\" - \"),\" - \")","v":{"v":5.25,"d":"5.25 "}},{"$f":"IF(Tabelle_Auswertung[[#This Row],[Bildname]]<>\"\",IF(Tabelle_Auswertung[[#This Row],[Punkte]]>0,RANK(Tabelle_Auswertung[[#This Row],[Punkte]],[Punkte],0),\" - \"),\" - \")","v":47},"Claudia Dommel",null,{"$f":"IF(Tabelle_Auswertung[[#This Row],[Platz]]=1,CONCATENATE(Tabelle_Auswertung[[#This Row],[Bildname]],\" von \",Tabelle_Auswertung[[#This Row],[Autor(in)]]),\"\")","v":""},{"$f":"IF(Tabelle_Auswertung[[#This Row],[Platz]]=2,CONCATENATE(Tabelle_Auswertung[[#This Row],[Bildname]],\" von \",Tabelle_Auswertung[[#This Row],[Autor(in)]]),\"\")","v":""},{"$f":"IF(Tabelle_Auswertung[[#This Row],[Platz]]=3,CONCATENATE(Tabelle_Auswertung[[#This Row],[Bildname]],\" von \",Tabelle_Auswertung[[#This Row],[Autor(in)]]),\"\")","v":""},{"$f":"IF(Tabelle_Auswertung[[#This Row],[Platz]]=4,CONCATENATE(Tabelle_Auswertung[[#This Row],[Bildname]],\" von \",Tabelle_Auswertung[[#This Row],[Autor(in)]]),\"\")","v":""},{"$f":"IF(Tabelle_Auswertung[[#This Row],[Platz]]=5,CONCATENATE(Tabelle_Auswertung[[#This Row],[Bildname]],\" von \",Tabelle_Auswertung[[#This Row],[Autor(in)]]),\"\")","v":""},{"$f":"IF(Tabelle_Auswertung[[#This Row],[Platz]]=6,CONCATENATE(Tabelle_Auswertung[[#This Row],[Bildname]],\" von \",Tabelle_Auswertung[[#This Row],[Autor(in)]]),\"\")","v":""},{"$f":"IF(Tabelle_Auswertung[[#This Row],[Platz]]=7,CONCATENATE(Tabelle_Auswertung[[#This Row],[Bildname]],\" von \",Tabelle_Auswertung[[#This Row],[Autor(in)]]),\"\")","v":""},{"$f":"IF(Tabelle_Auswertung[[#This Row],[Platz]]=8,CONCATENATE(Tabelle_Auswertung[[#This Row],[Bildname]],\" von \",Tabelle_Auswertung[[#This Row],[Autor(in)]]),\"\")","v":""},{"$f":"IF(Tabelle_Auswertung[[#This Row],[Platz]]=9,CONCATENATE(Tabelle_Auswertung[[#This Row],[Bildname]],\" von \",Tabelle_Auswertung[[#This Row],[Autor(in)]]),\"\")","v":""},{"$f":"IF(Tabelle_Auswertung[[#This Row],[Platz]]=10,CONCATENATE(Tabelle_Auswertung[[#This Row],[Bildname]],\" von \",Tabelle_Auswertung[[#This Row],[Autor(in)]]),\"\")","v":""}]
[49,"IMG_0890.JPG",6,8,6,4,9,5,5,4,{"$nulls":12},{"$f":"IF(Tabelle_Auswertung[[#This Row],[Bildname]]<>\"\",\n    IF(Tabelle_Auswertung[[#This Row],[abwesend]]=\"ja\",\n        SUM(Tabelle_Auswertung[[#This Row],[Juror 1]:[Juror 20]])/COUNT(Tabelle_Auswertung[[#This Row],[Juror 1]:[Juror 20]])*(COUNT(Tabelle_Auswertung[[#This Row],[Juror 1]:[Juror 20]])-1),\n        SUM(Tabelle_Auswertung[[#This Row],[Juror 1]:[Juror 20]])\n    ),\n\" - \")","v":41.125},{"$f":"IF(Tabelle_Auswertung[[#This Row],[Bildname]]<>\"\",IF(Tabelle_Auswertung[[#This Row],[Punkte]]>0,AVERAGE(Tabelle_Auswertung[[#This Row],[Juror 1]:[Juror 20]]),\" - \"),\" - \")","v":{"v":5.875,"d":"5.88 "}},{"$f":"IF(Tabelle_Auswertung[[#This Row],[Bildname]]<>\"\",IF(Tabelle_Auswertung[[#This Row],[Punkte]]>0,RANK(Tabelle_Auswertung[[#This Row],[Punkte]],[Punkte],0),\" - \"),\" - \")","v":49},"Andreas Toltz","ja",{"$f":"IF(Tabelle_Auswertung[[#This Row],[Platz]]=1,CONCATENATE(Tabelle_Auswertung[[#This Row],[Bildname]],\" von \",Tabelle_Auswertung[[#This Row],[Autor(in)]]),\"\")","v":""},{"$f":"IF(Tabelle_Auswertung[[#This Row],[Platz]]=2,CONCATENATE(Tabelle_Auswertung[[#This Row],[Bildname]],\" von \",Tabelle_Auswertung[[#This Row],[Autor(in)]]),\"\")","v":""},{"$f":"IF(Tabelle_Auswertung[[#This Row],[Platz]]=3,CONCATENATE(Tabelle_Auswertung[[#This Row],[Bildname]],\" von \",Tabelle_Auswertung[[#This Row],[Autor(in)]]),\"\")","v":""},{"$f":"IF(Tabelle_Auswertung[[#This Row],[Platz]]=4,CONCATENATE(Tabelle_Auswertung[[#This Row],[Bildname]],\" von \",Tabelle_Auswertung[[#This Row],[Autor(in)]]),\"\")","v":""},{"$f":"IF(Tabelle_Auswertung[[#This Row],[Platz]]=5,CONCATENATE(Tabelle_Auswertung[[#This Row],[Bildname]],\" von \",Tabelle_Auswertung[[#This Row],[Autor(in)]]),\"\")","v":""},{"$f":"IF(Tabelle_Auswertung[[#This Row],[Platz]]=6,CONCATENATE(Tabelle_Auswertung[[#This Row],[Bildname]],\" von \",Tabelle_Auswertung[[#This Row],[Autor(in)]]),\"\")","v":""},{"$f":"IF(Tabelle_Auswertung[[#This Row],[Platz]]=7,CONCATENATE(Tabelle_Auswertung[[#This Row],[Bildname]],\" von \",Tabelle_Auswertung[[#This Row],[Autor(in)]]),\"\")","v":""},{"$f":"IF(Tabelle_Auswertung[[#This Row],[Platz]]=8,CONCATENATE(Tabelle_Auswertung[[#This Row],[Bildname]],\" von \",Tabelle_Auswertung[[#This Row],[Autor(in)]]),\"\")","v":""},{"$f":"IF(Tabelle_Auswertung[[#This Row],[Platz]]=9,CONCATENATE(Tabelle_Auswertung[[#This Row],[Bildname]],\" von \",Tabelle_Auswertung[[#This Row],[Autor(in)]]),\"\")","v":""},{"$f":"IF(Tabelle_Auswertung[[#This Row],[Platz]]=10,CONCATENATE(Tabelle_Auswertung[[#This Row],[Bildname]],\" von \",Tabelle_Auswertung[[#This Row],[Autor(in)]]),\"\")","v":""}]
[50,"Italia.jpg",7,7,3,7,0,8,4,5,{"$nulls":12},{"$f":"IF(Tabelle_Auswertung[[#This Row],[Bildname]]<>\"\",\n    IF(Tabelle_Auswertung[[#This Row],[abwesend]]=\"ja\",\n        SUM(Tabelle_Auswertung[[#This Row],[Juror 1]:[Juror 20]])/COUNT(Tabelle_Auswertung[[#This Row],[Juror 1]:[Juror 20]])*(COUNT(Tabelle_Auswertung[[#This Row],[Juror 1]:[Juror 20]])-1),\n        SUM(Tabelle_Auswertung[[#This Row],[Juror 1]:[Juror 20]])\n    ),\n\" - \")","v":41},{"$f":"IF(Tabelle_Auswertung[[#This Row],[Bildname]]<>\"\",IF(Tabelle_Auswertung[[#This Row],[Punkte]]>0,AVERAGE(Tabelle_Auswertung[[#This Row],[Juror 1]:[Juror 20]]),\" - \"),\" - \")","v":{"v":5.125,"d":"5.13 "}},{"$f":"IF(Tabelle_Auswertung[[#This Row],[Bildname]]<>\"\",IF(Tabelle_Auswertung[[#This Row],[Punkte]]>0,RANK(Tabelle_Auswertung[[#This Row],[Punkte]],[Punkte],0),\" - \"),\" - \")","v":50},"Jan Grünler",null,{"$f":"IF(Tabelle_Auswertung[[#This Row],[Platz]]=1,CONCATENATE(Tabelle_Auswertung[[#This Row],[Bildname]],\" von \",Tabelle_Auswertung[[#This Row],[Autor(in)]]),\"\")","v":""},{"$f":"IF(Tabelle_Auswertung[[#This Row],[Platz]]=2,CONCATENATE(Tabelle_Auswertung[[#This Row],[Bildname]],\" von \",Tabelle_Auswertung[[#This Row],[Autor(in)]]),\"\")","v":""},{"$f":"IF(Tabelle_Auswertung[[#This Row],[Platz]]=3,CONCATENATE(Tabelle_Auswertung[[#This Row],[Bildname]],\" von \",Tabelle_Auswertung[[#This Row],[Autor(in)]]),\"\")","v":""},{"$f":"IF(Tabelle_Auswertung[[#This Row],[Platz]]=4,CONCATENATE(Tabelle_Auswertung[[#This Row],[Bildname]],\" von \",Tabelle_Auswertung[[#This Row],[Autor(in)]]),\"\")","v":""},{"$f":"IF(Tabelle_Auswertung[[#This Row],[Platz]]=5,CONCATENATE(Tabelle_Auswertung[[#This Row],[Bildname]],\" von \",Tabelle_Auswertung[[#This Row],[Autor(in)]]),\"\")","v":""},{"$f":"IF(Tabelle_Auswertung[[#This Row],[Platz]]=6,CONCATENATE(Tabelle_Auswertung[[#This Row],[Bildname]],\" von \",Tabelle_Auswertung[[#This Row],[Autor(in)]]),\"\")","v":""},{"$f":"IF(Tabelle_Auswertung[[#This Row],[Platz]]=7,CONCATENATE(Tabelle_Auswertung[[#This Row],[Bildname]],\" von \",Tabelle_Auswertung[[#This Row],[Autor(in)]]),\"\")","v":""},{"$f":"IF(Tabelle_Auswertung[[#This Row],[Platz]]=8,CONCATENATE(Tabelle_Auswertung[[#This Row],[Bildname]],\" von \",Tabelle_Auswertung[[#This Row],[Autor(in)]]),\"\")","v":""},{"$f":"IF(Tabelle_Auswertung[[#This Row],[Platz]]=9,CONCATENATE(Tabelle_Auswertung[[#This Row],[Bildname]],\" von \",Tabelle_Auswertung[[#This Row],[Autor(in)]]),\"\")","v":""},{"$f":"IF(Tabelle_Auswertung[[#This Row],[Platz]]=10,CONCATENATE(Tabelle_Auswertung[[#This Row],[Bildname]],\" von \",Tabelle_Auswertung[[#This Row],[Autor(in)]]),\"\")","v":""}]
[51,"IMG_0123.JPG",5,6,6,8,7,5,4,5,{"$nulls":12},{"$f":"IF(Tabelle_Auswertung[[#This Row],[Bildname]]<>\"\",\n    IF(Tabelle_Auswertung[[#This Row],[abwesend]]=\"ja\",\n        SUM(Tabelle_Auswertung[[#This Row],[Juror 1]:[Juror 20]])/COUNT(Tabelle_Auswertung[[#This Row],[Juror 1]:[Juror 20]])*(COUNT(Tabelle_Auswertung[[#This Row],[Juror 1]:[Juror 20]])-1),\n        SUM(Tabelle_Auswertung[[#This Row],[Juror 1]:[Juror 20]])\n    ),\n\" - \")","v":40.25},{"$f":"IF(Tabelle_Auswertung[[#This Row],[Bildname]]<>\"\",IF(Tabelle_Auswertung[[#This Row],[Punkte]]>0,AVERAGE(Tabelle_Auswertung[[#This Row],[Juror 1]:[Juror 20]]),\" - \"),\" - \")","v":{"v":5.75,"d":"5.75 "}},{"$f":"IF(Tabelle_Auswertung[[#This Row],[Bildname]]<>\"\",IF(Tabelle_Auswertung[[#This Row],[Punkte]]>0,RANK(Tabelle_Auswertung[[#This Row],[Punkte]],[Punkte],0),\" - \"),\" - \")","v":51},"Andreas Toltz","ja",{"$f":"IF(Tabelle_Auswertung[[#This Row],[Platz]]=1,CONCATENATE(Tabelle_Auswertung[[#This Row],[Bildname]],\" von \",Tabelle_Auswertung[[#This Row],[Autor(in)]]),\"\")","v":""},{"$f":"IF(Tabelle_Auswertung[[#This Row],[Platz]]=2,CONCATENATE(Tabelle_Auswertung[[#This Row],[Bildname]],\" von \",Tabelle_Auswertung[[#This Row],[Autor(in)]]),\"\")","v":""},{"$f":"IF(Tabelle_Auswertung[[#This Row],[Platz]]=3,CONCATENATE(Tabelle_Auswertung[[#This Row],[Bildname]],\" von \",Tabelle_Auswertung[[#This Row],[Autor(in)]]),\"\")","v":""},{"$f":"IF(Tabelle_Auswertung[[#This Row],[Platz]]=4,CONCATENATE(Tabelle_Auswertung[[#This Row],[Bildname]],\" von \",Tabelle_Auswertung[[#This Row],[Autor(in)]]),\"\")","v":""},{"$f":"IF(Tabelle_Auswertung[[#This Row],[Platz]]=5,CONCATENATE(Tabelle_Auswertung[[#This Row],[Bildname]],\" von \",Tabelle_Auswertung[[#This Row],[Autor(in)]]),\"\")","v":""},{"$f":"IF(Tabelle_Auswertung[[#This Row],[Platz]]=6,CONCATENATE(Tabelle_Auswertung[[#This Row],[Bildname]],\" von \",Tabelle_Auswertung[[#This Row],[Autor(in)]]),\"\")","v":""},{"$f":"IF(Tabelle_Auswertung[[#This Row],[Platz]]=7,CONCATENATE(Tabelle_Auswertung[[#This Row],[Bildname]],\" von \",Tabelle_Auswertung[[#This Row],[Autor(in)]]),\"\")","v":""},{"$f":"IF(Tabelle_Auswertung[[#This Row],[Platz]]=8,CONCATENATE(Tabelle_Auswertung[[#This Row],[Bildname]],\" von \",Tabelle_Auswertung[[#This Row],[Autor(in)]]),\"\")","v":""},{"$f":"IF(Tabelle_Auswertung[[#This Row],[Platz]]=9,CONCATENATE(Tabelle_Auswertung[[#This Row],[Bildname]],\" von \",Tabelle_Auswertung[[#This Row],[Autor(in)]]),\"\")","v":""},{"$f":"IF(Tabelle_Auswertung[[#This Row],[Platz]]=10,CONCATENATE(Tabelle_Auswertung[[#This Row],[Bildname]],\" von \",Tabelle_Auswertung[[#This Row],[Autor(in)]]),\"\")","v":""}]
[52,"Dialog.JPG",6,7,0,6,5,5,6,5,{"$nulls":12},{"$f":"IF(Tabelle_Auswertung[[#This Row],[Bildname]]<>\"\",\n    IF(Tabelle_Auswertung[[#This Row],[abwesend]]=\"ja\",\n        SUM(Tabelle_Auswertung[[#This Row],[Juror 1]:[Juror 20]])/COUNT(Tabelle_Auswertung[[#This Row],[Juror 1]:[Juror 20]])*(COUNT(Tabelle_Auswertung[[#This Row],[Juror 1]:[Juror 20]])-1),\n        SUM(Tabelle_Auswertung[[#This Row],[Juror 1]:[Juror 20]])\n    ),\n\" - \")","v":40},{"$f":"IF(Tabelle_Auswertung[[#This Row],[Bildname]]<>\"\",IF(Tabelle_Auswertung[[#This Row],[Punkte]]>0,AVERAGE(Tabelle_Auswertung[[#This Row],[Juror 1]:[Juror 20]]),\" - \"),\" - \")","v":{"v":5,"d":"5.00 "}},{"$f":"IF(Tabelle_Auswertung[[#This Row],[Bildname]]<>\"\",IF(Tabelle_Auswertung[[#This Row],[Punkte]]>0,RANK(Tabelle_Auswertung[[#This Row],[Punkte]],[Punkte],0),\" - \"),\" - \")","v":52},"Albrecht Flierl",null,{"$f":"IF(Tabelle_Auswertung[[#This Row],[Platz]]=1,CONCATENATE(Tabelle_Auswertung[[#This Row],[Bildname]],\" von \",Tabelle_Auswertung[[#This Row],[Autor(in)]]),\"\")","v":""},{"$f":"IF(Tabelle_Auswertung[[#This Row],[Platz]]=2,CONCATENATE(Tabelle_Auswertung[[#This Row],[Bildname]],\" von \",Tabelle_Auswertung[[#This Row],[Autor(in)]]),\"\")","v":""},{"$f":"IF(Tabelle_Auswertung[[#This Row],[Platz]]=3,CONCATENATE(Tabelle_Auswertung[[#This Row],[Bildname]],\" von \",Tabelle_Auswertung[[#This Row],[Autor(in)]]),\"\")","v":""},{"$f":"IF(Tabelle_Auswertung[[#This Row],[Platz]]=4,CONCATENATE(Tabelle_Auswertung[[#This Row],[Bildname]],\" von \",Tabelle_Auswertung[[#This Row],[Autor(in)]]),\"\")","v":""},{"$f":"IF(Tabelle_Auswertung[[#This Row],[Platz]]=5,CONCATENATE(Tabelle_Auswertung[[#This Row],[Bildname]],\" von \",Tabelle_Auswertung[[#This Row],[Autor(in)]]),\"\")","v":""},{"$f":"IF(Tabelle_Auswertung[[#This Row],[Platz]]=6,CONCATENATE(Tabelle_Auswertung[[#This Row],[Bildname]],\" von \",Tabelle_Auswertung[[#This Row],[Autor(in)]]),\"\")","v":""},{"$f":"IF(Tabelle_Auswertung[[#This Row],[Platz]]=7,CONCATENATE(Tabelle_Auswertung[[#This Row],[Bildname]],\" von \",Tabelle_Auswertung[[#This Row],[Autor(in)]]),\"\")","v":""},{"$f":"IF(Tabelle_Auswertung[[#This Row],[Platz]]=8,CONCATENATE(Tabelle_Auswertung[[#This Row],[Bildname]],\" von \",Tabelle_Auswertung[[#This Row],[Autor(in)]]),\"\")","v":""},{"$f":"IF(Tabelle_Auswertung[[#This Row],[Platz]]=9,CONCATENATE(Tabelle_Auswertung[[#This Row],[Bildname]],\" von \",Tabelle_Auswertung[[#This Row],[Autor(in)]]),\"\")","v":""},{"$f":"IF(Tabelle_Auswertung[[#This Row],[Platz]]=10,CONCATENATE(Tabelle_Auswertung[[#This Row],[Bildname]],\" von \",Tabelle_Auswertung[[#This Row],[Autor(in)]]),\"\")","v":""}]
[53,"Raindrops.jpg",7,5,5,10,6,0,3,4,{"$nulls":12},{"$f":"IF(Tabelle_Auswertung[[#This Row],[Bildname]]<>\"\",\n    IF(Tabelle_Auswertung[[#This Row],[abwesend]]=\"ja\",\n        SUM(Tabelle_Auswertung[[#This Row],[Juror 1]:[Juror 20]])/COUNT(Tabelle_Auswertung[[#This Row],[Juror 1]:[Juror 20]])*(COUNT(Tabelle_Auswertung[[#This Row],[Juror 1]:[Juror 20]])-1),\n        SUM(Tabelle_Auswertung[[#This Row],[Juror 1]:[Juror 20]])\n    ),\n\" - \")","v":40},{"$f":"IF(Tabelle_Auswertung[[#This Row],[Bildname]]<>\"\",IF(Tabelle_Auswertung[[#This Row],[Punkte]]>0,AVERAGE(Tabelle_Auswertung[[#This Row],[Juror 1]:[Juror 20]]),\" - \"),\" - \")","v":{"v":5,"d":"5.00 "}},{"$f":"IF(Tabelle_Auswertung[[#This Row],[Bildname]]<>\"\",IF(Tabelle_Auswertung[[#This Row],[Punkte]]>0,RANK(Tabelle_Auswertung[[#This Row],[Punkte]],[Punkte],0),\" - \"),\" - \")","v":52},"Antje Finsterer",null,{"$f":"IF(Tabelle_Auswertung[[#This Row],[Platz]]=1,CONCATENATE(Tabelle_Auswertung[[#This Row],[Bildname]],\" von \",Tabelle_Auswertung[[#This Row],[Autor(in)]]),\"\")","v":""},{"$f":"IF(Tabelle_Auswertung[[#This Row],[Platz]]=2,CONCATENATE(Tabelle_Auswertung[[#This Row],[Bildname]],\" von \",Tabelle_Auswertung[[#This Row],[Autor(in)]]),\"\")","v":""},{"$f":"IF(Tabelle_Auswertung[[#This Row],[Platz]]=3,CONCATENATE(Tabelle_Auswertung[[#This Row],[Bildname]],\" von \",Tabelle_Auswertung[[#This Row],[Autor(in)]]),\"\")","v":""},{"$f":"IF(Tabelle_Auswertung[[#This Row],[Platz]]=4,CONCATENATE(Tabelle_Auswertung[[#This Row],[Bildname]],\" von \",Tabelle_Auswertung[[#This Row],[Autor(in)]]),\"\")","v":""},{"$f":"IF(Tabelle_Auswertung[[#This Row],[Platz]]=5,CONCATENATE(Tabelle_Auswertung[[#This Row],[Bildname]],\" von \",Tabelle_Auswertung[[#This Row],[Autor(in)]]),\"\")","v":""},{"$f":"IF(Tabelle_Auswertung[[#This Row],[Platz]]=6,CONCATENATE(Tabelle_Auswertung[[#This Row],[Bildname]],\" von \",Tabelle_Auswertung[[#This Row],[Autor(in)]]),\"\")","v":""},{"$f":"IF(Tabelle_Auswertung[[#This Row],[Platz]]=7,CONCATENATE(Tabelle_Auswertung[[#This Row],[Bildname]],\" von \",Tabelle_Auswertung[[#This Row],[Autor(in)]]),\"\")","v":""},{"$f":"IF(Tabelle_Auswertung[[#This Row],[Platz]]=8,CONCATENATE(Tabelle_Auswertung[[#This Row],[Bildname]],\" von \",Tabelle_Auswertung[[#This Row],[Autor(in)]]),\"\")","v":""},{"$f":"IF(Tabelle_Auswertung[[#This Row],[Platz]]=9,CONCATENATE(Tabelle_Auswertung[[#This Row],[Bildname]],\" von \",Tabelle_Auswertung[[#This Row],[Autor(in)]]),\"\")","v":""},{"$f":"IF(Tabelle_Auswertung[[#This Row],[Platz]]=10,CONCATENATE(Tabelle_Auswertung[[#This Row],[Bildname]],\" von \",Tabelle_Auswertung[[#This Row],[Autor(in)]]),\"\")","v":""}]
[54,"Rastplatz.JPG",5,8,0,6,4,6,6,4,{"$nulls":12},{"$f":"IF(Tabelle_Auswertung[[#This Row],[Bildname]]<>\"\",\n    IF(Tabelle_Auswertung[[#This Row],[abwesend]]=\"ja\",\n        SUM(Tabelle_Auswertung[[#This Row],[Juror 1]:[Juror 20]])/COUNT(Tabelle_Auswertung[[#This Row],[Juror 1]:[Juror 20]])*(COUNT(Tabelle_Auswertung[[#This Row],[Juror 1]:[Juror 20]])-1),\n        SUM(Tabelle_Auswertung[[#This Row],[Juror 1]:[Juror 20]])\n    ),\n\" - \")","v":39},{"$f":"IF(Tabelle_Auswertung[[#This Row],[Bildname]]<>\"\",IF(Tabelle_Auswertung[[#This Row],[Punkte]]>0,AVERAGE(Tabelle_Auswertung[[#This Row],[Juror 1]:[Juror 20]]),\" - \"),\" - \")","v":4.875},{"$f":"IF(Tabelle_Auswertung[[#This Row],[Bildname]]<>\"\",IF(Tabelle_Auswertung[[#This Row],[Punkte]]>0,RANK(Tabelle_Auswertung[[#This Row],[Punkte]],[Punkte],0),\" - \"),\" - \")","v":54},"Albrecht Flierl",null,{"$f":"IF(Tabelle_Auswertung[[#This Row],[Platz]]=1,CONCATENATE(Tabelle_Auswertung[[#This Row],[Bildname]],\" von \",Tabelle_Auswertung[[#This Row],[Autor(in)]]),\"\")","v":""},{"$f":"IF(Tabelle_Auswertung[[#This Row],[Platz]]=2,CONCATENATE(Tabelle_Auswertung[[#This Row],[Bildname]],\" von \",Tabelle_Auswertung[[#This Row],[Autor(in)]]),\"\")","v":""},{"$f":"IF(Tabelle_Auswertung[[#This Row],[Platz]]=3,CONCATENATE(Tabelle_Auswertung[[#This Row],[Bildname]],\" von \",Tabelle_Auswertung[[#This Row],[Autor(in)]]),\"\")","v":""},{"$f":"IF(Tabelle_Auswertung[[#This Row],[Platz]]=4,CONCATENATE(Tabelle_Auswertung[[#This Row],[Bildname]],\" von \",Tabelle_Auswertung[[#This Row],[Autor(in)]]),\"\")","v":""},{"$f":"IF(Tabelle_Auswertung[[#This Row],[Platz]]=5,CONCATENATE(Tabelle_Auswertung[[#This Row],[Bildname]],\" von \",Tabelle_Auswertung[[#This Row],[Autor(in)]]),\"\")","v":""},{"$f":"IF(Tabelle_Auswertung[[#This Row],[Platz]]=6,CONCATENATE(Tabelle_Auswertung[[#This Row],[Bildname]],\" von \",Tabelle_Auswertung[[#This Row],[Autor(in)]]),\"\")","v":""},{"$f":"IF(Tabelle_Auswertung[[#This Row],[Platz]]=7,CONCATENATE(Tabelle_Auswertung[[#This Row],[Bildname]],\" von \",Tabelle_Auswertung[[#This Row],[Autor(in)]]),\"\")","v":""},{"$f":"IF(Tabelle_Auswertung[[#This Row],[Platz]]=8,CONCATENATE(Tabelle_Auswertung[[#This Row],[Bildname]],\" von \",Tabelle_Auswertung[[#This Row],[Autor(in)]]),\"\")","v":""},{"$f":"IF(Tabelle_Auswertung[[#This Row],[Platz]]=9,CONCATENATE(Tabelle_Auswertung[[#This Row],[Bildname]],\" von \",Tabelle_Auswertung[[#This Row],[Autor(in)]]),\"\")","v":""},{"$f":"IF(Tabelle_Auswertung[[#This Row],[Platz]]=10,CONCATENATE(Tabelle_Auswertung[[#This Row],[Bildname]],\" von \",Tabelle_Auswertung[[#This Row],[Autor(in)]]),\"\")","v":""}]
[55,"steakhouse.jpg",5,7,6,6,5,4,5,0,{"$nulls":12},{"$f":"IF(Tabelle_Auswertung[[#This Row],[Bildname]]<>\"\",\n    IF(Tabelle_Auswertung[[#This Row],[abwesend]]=\"ja\",\n        SUM(Tabelle_Auswertung[[#This Row],[Juror 1]:[Juror 20]])/COUNT(Tabelle_Auswertung[[#This Row],[Juror 1]:[Juror 20]])*(COUNT(Tabelle_Auswertung[[#This Row],[Juror 1]:[Juror 20]])-1),\n        SUM(Tabelle_Auswertung[[#This Row],[Juror 1]:[Juror 20]])\n    ),\n\" - \")","v":38},{"$f":"IF(Tabelle_Auswertung[[#This Row],[Bildname]]<>\"\",IF(Tabelle_Auswertung[[#This Row],[Punkte]]>0,AVERAGE(Tabelle_Auswertung[[#This Row],[Juror 1]:[Juror 20]]),\" - \"),\" - \")","v":4.75},{"$f":"IF(Tabelle_Auswertung[[#This Row],[Bildname]]<>\"\",IF(Tabelle_Auswertung[[#This Row],[Punkte]]>0,RANK(Tabelle_Auswertung[[#This Row],[Punkte]],[Punkte],0),\" - \"),\" - \")","v":55},"Gerhard Rieß",null,{"$f":"IF(Tabelle_Auswertung[[#This Row],[Platz]]=1,CONCATENATE(Tabelle_Auswertung[[#This Row],[Bildname]],\" von \",Tabelle_Auswertung[[#This Row],[Autor(in)]]),\"\")","v":""},{"$f":"IF(Tabelle_Auswertung[[#This Row],[Platz]]=2,CONCATENATE(Tabelle_Auswertung[[#This Row],[Bildname]],\" von \",Tabelle_Auswertung[[#This Row],[Autor(in)]]),\"\")","v":""},{"$f":"IF(Tabelle_Auswertung[[#This Row],[Platz]]=3,CONCATENATE(Tabelle_Auswertung[[#This Row],[Bildname]],\" von \",Tabelle_Auswertung[[#This Row],[Autor(in)]]),\"\")","v":""},{"$f":"IF(Tabelle_Auswertung[[#This Row],[Platz]]=4,CONCATENATE(Tabelle_Auswertung[[#This Row],[Bildname]],\" von \",Tabelle_Auswertung[[#This Row],[Autor(in)]]),\"\")","v":""},{"$f":"IF(Tabelle_Auswertung[[#This Row],[Platz]]=5,CONCATENATE(Tabelle_Auswertung[[#This Row],[Bildname]],\" von \",Tabelle_Auswertung[[#This Row],[Autor(in)]]),\"\")","v":""},{"$f":"IF(Tabelle_Auswertung[[#This Row],[Platz]]=6,CONCATENATE(Tabelle_Auswertung[[#This Row],[Bildname]],\" von \",Tabelle_Auswertung[[#This Row],[Autor(in)]]),\"\")","v":""},{"$f":"IF(Tabelle_Auswertung[[#This Row],[Platz]]=7,CONCATENATE(Tabelle_Auswertung[[#This Row],[Bildname]],\" von \",Tabelle_Auswertung[[#This Row],[Autor(in)]]),\"\")","v":""},{"$f":"IF(Tabelle_Auswertung[[#This Row],[Platz]]=8,CONCATENATE(Tabelle_Auswertung[[#This Row],[Bildname]],\" von \",Tabelle_Auswertung[[#This Row],[Autor(in)]]),\"\")","v":""},{"$f":"IF(Tabelle_Auswertung[[#This Row],[Platz]]=9,CONCATENATE(Tabelle_Auswertung[[#This Row],[Bildname]],\" von \",Tabelle_Auswertung[[#This Row],[Autor(in)]]),\"\")","v":""},{"$f":"IF(Tabelle_Auswertung[[#This Row],[Platz]]=10,CONCATENATE(Tabelle_Auswertung[[#This Row],[Bildname]],\" von \",Tabelle_Auswertung[[#This Row],[Autor(in)]]),\"\")","v":""}]
[56,"Verspiegelt.JPG",6,6,0,6,5,4,6,4,{"$nulls":12},{"$f":"IF(Tabelle_Auswertung[[#This Row],[Bildname]]<>\"\",\n    IF(Tabelle_Auswertung[[#This Row],[abwesend]]=\"ja\",\n        SUM(Tabelle_Auswertung[[#This Row],[Juror 1]:[Juror 20]])/COUNT(Tabelle_Auswertung[[#This Row],[Juror 1]:[Juror 20]])*(COUNT(Tabelle_Auswertung[[#This Row],[Juror 1]:[Juror 20]])-1),\n        SUM(Tabelle_Auswertung[[#This Row],[Juror 1]:[Juror 20]])\n    ),\n\" - \")","v":37},{"$f":"IF(Tabelle_Auswertung[[#This Row],[Bildname]]<>\"\",IF(Tabelle_Auswertung[[#This Row],[Punkte]]>0,AVERAGE(Tabelle_Auswertung[[#This Row],[Juror 1]:[Juror 20]]),\" - \"),\" - \")","v":4.625},{"$f":"IF(Tabelle_Auswertung[[#This Row],[Bildname]]<>\"\",IF(Tabelle_Auswertung[[#This Row],[Punkte]]>0,RANK(Tabelle_Auswertung[[#This Row],[Punkte]],[Punkte],0),\" - \"),\" - \")","v":56},"Albrecht Flierl",null,{"$f":"IF(Tabelle_Auswertung[[#This Row],[Platz]]=1,CONCATENATE(Tabelle_Auswertung[[#This Row],[Bildname]],\" von \",Tabelle_Auswertung[[#This Row],[Autor(in)]]),\"\")","v":""},{"$f":"IF(Tabelle_Auswertung[[#This Row],[Platz]]=2,CONCATENATE(Tabelle_Auswertung[[#This Row],[Bildname]],\" von \",Tabelle_Auswertung[[#This Row],[Autor(in)]]),\"\")","v":""},{"$f":"IF(Tabelle_Auswertung[[#This Row],[Platz]]=3,CONCATENATE(Tabelle_Auswertung[[#This Row],[Bildname]],\" von \",Tabelle_Auswertung[[#This Row],[Autor(in)]]),\"\")","v":""},{"$f":"IF(Tabelle_Auswertung[[#This Row],[Platz]]=4,CONCATENATE(Tabelle_Auswertung[[#This Row],[Bildname]],\" von \",Tabelle_Auswertung[[#This Row],[Autor(in)]]),\"\")","v":""},{"$f":"IF(Tabelle_Auswertung[[#This Row],[Platz]]=5,CONCATENATE(Tabelle_Auswertung[[#This Row],[Bildname]],\" von \",Tabelle_Auswertung[[#This Row],[Autor(in)]]),\"\")","v":""},{"$f":"IF(Tabelle_Auswertung[[#This Row],[Platz]]=6,CONCATENATE(Tabelle_Auswertung[[#This Row],[Bildname]],\" von \",Tabelle_Auswertung[[#This Row],[Autor(in)]]),\"\")","v":""},{"$f":"IF(Tabelle_Auswertung[[#This Row],[Platz]]=7,CONCATENATE(Tabelle_Auswertung[[#This Row],[Bildname]],\" von \",Tabelle_Auswertung[[#This Row],[Autor(in)]]),\"\")","v":""},{"$f":"IF(Tabelle_Auswertung[[#This Row],[Platz]]=8,CONCATENATE(Tabelle_Auswertung[[#This Row],[Bildname]],\" von \",Tabelle_Auswertung[[#This Row],[Autor(in)]]),\"\")","v":""},{"$f":"IF(Tabelle_Auswertung[[#This Row],[Platz]]=9,CONCATENATE(Tabelle_Auswertung[[#This Row],[Bildname]],\" von \",Tabelle_Auswertung[[#This Row],[Autor(in)]]),\"\")","v":""},{"$f":"IF(Tabelle_Auswertung[[#This Row],[Platz]]=10,CONCATENATE(Tabelle_Auswertung[[#This Row],[Bildname]],\" von \",Tabelle_Auswertung[[#This Row],[Autor(in)]]),\"\")","v":""}]
[57,"Historie und Moderne.JPG",0,6,4,5,4,7,4,4,{"$nulls":12},{"$f":"IF(Tabelle_Auswertung[[#This Row],[Bildname]]<>\"\",\n    IF(Tabelle_Auswertung[[#This Row],[abwesend]]=\"ja\",\n        SUM(Tabelle_Auswertung[[#This Row],[Juror 1]:[Juror 20]])/COUNT(Tabelle_Auswertung[[#This Row],[Juror 1]:[Juror 20]])*(COUNT(Tabelle_Auswertung[[#This Row],[Juror 1]:[Juror 20]])-1),\n        SUM(Tabelle_Auswertung[[#This Row],[Juror 1]:[Juror 20]])\n    ),\n\" - \")","v":34},{"$f":"IF(Tabelle_Auswertung[[#This Row],[Bildname]]<>\"\",IF(Tabelle_Auswertung[[#This Row],[Punkte]]>0,AVERAGE(Tabelle_Auswertung[[#This Row],[Juror 1]:[Juror 20]]),\" - \"),\" - \")","v":4.25},{"$f":"IF(Tabelle_Auswertung[[#This Row],[Bildname]]<>\"\",IF(Tabelle_Auswertung[[#This Row],[Punkte]]>0,RANK(Tabelle_Auswertung[[#This Row],[Punkte]],[Punkte],0),\" - \"),\" - \")","v":57},"Claudia Dommel",null,{"$f":"IF(Tabelle_Auswertung[[#This Row],[Platz]]=1,CONCATENATE(Tabelle_Auswertung[[#This Row],[Bildname]],\" von \",Tabelle_Auswertung[[#This Row],[Autor(in)]]),\"\")","v":""},{"$f":"IF(Tabelle_Auswertung[[#This Row],[Platz]]=2,CONCATENATE(Tabelle_Auswertung[[#This Row],[Bildname]],\" von \",Tabelle_Auswertung[[#This Row],[Autor(in)]]),\"\")","v":""},{"$f":"IF(Tabelle_Auswertung[[#This Row],[Platz]]=3,CONCATENATE(Tabelle_Auswertung[[#This Row],[Bildname]],\" von \",Tabelle_Auswertung[[#This Row],[Autor(in)]]),\"\")","v":""},{"$f":"IF(Tabelle_Auswertung[[#This Row],[Platz]]=4,CONCATENATE(Tabelle_Auswertung[[#This Row],[Bildname]],\" von \",Tabelle_Auswertung[[#This Row],[Autor(in)]]),\"\")","v":""},{"$f":"IF(Tabelle_Auswertung[[#This Row],[Platz]]=5,CONCATENATE(Tabelle_Auswertung[[#This Row],[Bildname]],\" von \",Tabelle_Auswertung[[#This Row],[Autor(in)]]),\"\")","v":""},{"$f":"IF(Tabelle_Auswertung[[#This Row],[Platz]]=6,CONCATENATE(Tabelle_Auswertung[[#This Row],[Bildname]],\" von \",Tabelle_Auswertung[[#This Row],[Autor(in)]]),\"\")","v":""},{"$f":"IF(Tabelle_Auswertung[[#This Row],[Platz]]=7,CONCATENATE(Tabelle_Auswertung[[#This Row],[Bildname]],\" von \",Tabelle_Auswertung[[#This Row],[Autor(in)]]),\"\")","v":""},{"$f":"IF(Tabelle_Auswertung[[#This Row],[Platz]]=8,CONCATENATE(Tabelle_Auswertung[[#This Row],[Bildname]],\" von \",Tabelle_Auswertung[[#This Row],[Autor(in)]]),\"\")","v":""},{"$f":"IF(Tabelle_Auswertung[[#This Row],[Platz]]=9,CONCATENATE(Tabelle_Auswertung[[#This Row],[Bildname]],\" von \",Tabelle_Auswertung[[#This Row],[Autor(in)]]),\"\")","v":""},{"$f":"IF(Tabelle_Auswertung[[#This Row],[Platz]]=10,CONCATENATE(Tabelle_Auswertung[[#This Row],[Bildname]],\" von \",Tabelle_Auswertung[[#This Row],[Autor(in)]]),\"\")","v":""}]
[58,"exotische Schoenheit.JPG",0,5,5,7,6,2,4,4,{"$nulls":12},{"$f":"IF(Tabelle_Auswertung[[#This Row],[Bildname]]<>\"\",\n    IF(Tabelle_Auswertung[[#This Row],[abwesend]]=\"ja\",\n        SUM(Tabelle_Auswertung[[#This Row],[Juror 1]:[Juror 20]])/COUNT(Tabelle_Auswertung[[#This Row],[Juror 1]:[Juror 20]])*(COUNT(Tabelle_Auswertung[[#This Row],[Juror 1]:[Juror 20]])-1),\n        SUM(Tabelle_Auswertung[[#This Row],[Juror 1]:[Juror 20]])\n    ),\n\" - \")","v":33},{"$f":"IF(Tabelle_Auswertung[[#This Row],[Bildname]]<>\"\",IF(Tabelle_Auswertung[[#This Row],[Punkte]]>0,AVERAGE(Tabelle_Auswertung[[#This Row],[Juror 1]:[Juror 20]]),\" - \"),\" - \")","v":{"v":4.125,"d":"4.13 "}},{"$f":"IF(Tabelle_Auswertung[[#This Row],[Bildname]]<>\"\",IF(Tabelle_Auswertung[[#This Row],[Punkte]]>0,RANK(Tabelle_Auswertung[[#This Row],[Punkte]],[Punkte],0),\" - \"),\" - \")","v":58},"Claudia Dommel",null,{"$f":"IF(Tabelle_Auswertung[[#This Row],[Platz]]=1,CONCATENATE(Tabelle_Auswertung[[#This Row],[Bildname]],\" von \",Tabelle_Auswertung[[#This Row],[Autor(in)]]),\"\")","v":""},{"$f":"IF(Tabelle_Auswertung[[#This Row],[Platz]]=2,CONCATENATE(Tabelle_Auswertung[[#This Row],[Bildname]],\" von \",Tabelle_Auswertung[[#This Row],[Autor(in)]]),\"\")","v":""},{"$f":"IF(Tabelle_Auswertung[[#This Row],[Platz]]=3,CONCATENATE(Tabelle_Auswertung[[#This Row],[Bildname]],\" von \",Tabelle_Auswertung[[#This Row],[Autor(in)]]),\"\")","v":""},{"$f":"IF(Tabelle_Auswertung[[#This Row],[Platz]]=4,CONCATENATE(Tabelle_Auswertung[[#This Row],[Bildname]],\" von \",Tabelle_Auswertung[[#This Row],[Autor(in)]]),\"\")","v":""},{"$f":"IF(Tabelle_Auswertung[[#This Row],[Platz]]=5,CONCATENATE(Tabelle_Auswertung[[#This Row],[Bildname]],\" von \",Tabelle_Auswertung[[#This Row],[Autor(in)]]),\"\")","v":""},{"$f":"IF(Tabelle_Auswertung[[#This Row],[Platz]]=6,CONCATENATE(Tabelle_Auswertung[[#This Row],[Bildname]],\" von \",Tabelle_Auswertung[[#This Row],[Autor(in)]]),\"\")","v":""},{"$f":"IF(Tabelle_Auswertung[[#This Row],[Platz]]=7,CONCATENATE(Tabelle_Auswertung[[#This Row],[Bildname]],\" von \",Tabelle_Auswertung[[#This Row],[Autor(in)]]),\"\")","v":""},{"$f":"IF(Tabelle_Auswertung[[#This Row],[Platz]]=8,CONCATENATE(Tabelle_Auswertung[[#This Row],[Bildname]],\" von \",Tabelle_Auswertung[[#This Row],[Autor(in)]]),\"\")","v":""},{"$f":"IF(Tabelle_Auswertung[[#This Row],[Platz]]=9,CONCATENATE(Tabelle_Auswertung[[#This Row],[Bildname]],\" von \",Tabelle_Auswertung[[#This Row],[Autor(in)]]),\"\")","v":""},{"$f":"IF(Tabelle_Auswertung[[#This Row],[Platz]]=10,CONCATENATE(Tabelle_Auswertung[[#This Row],[Bildname]],\" von \",Tabelle_Auswertung[[#This Row],[Autor(in)]]),\"\")","v":""}]
[59,"oesterliche Kunst.JPG",0,6,5,5,3,3,3,4,{"$nulls":12},{"$f":"IF(Tabelle_Auswertung[[#This Row],[Bildname]]<>\"\",\n    IF(Tabelle_Auswertung[[#This Row],[abwesend]]=\"ja\",\n        SUM(Tabelle_Auswertung[[#This Row],[Juror 1]:[Juror 20]])/COUNT(Tabelle_Auswertung[[#This Row],[Juror 1]:[Juror 20]])*(COUNT(Tabelle_Auswertung[[#This Row],[Juror 1]:[Juror 20]])-1),\n        SUM(Tabelle_Auswertung[[#This Row],[Juror 1]:[Juror 20]])\n    ),\n\" - \")","v":29},{"$f":"IF(Tabelle_Auswertung[[#This Row],[Bildname]]<>\"\",IF(Tabelle_Auswertung[[#This Row],[Punkte]]>0,AVERAGE(Tabelle_Auswertung[[#This Row],[Juror 1]:[Juror 20]]),\" - \"),\" - \")","v":{"v":3.625,"d":"3.63 "}},{"$f":"IF(Tabelle_Auswertung[[#This Row],[Bildname]]<>\"\",IF(Tabelle_Auswertung[[#This Row],[Punkte]]>0,RANK(Tabelle_Auswertung[[#This Row],[Punkte]],[Punkte],0),\" - \"),\" - \")","v":59},"Claudia Dommel",null,{"$f":"IF(Tabelle_Auswertung[[#This Row],[Platz]]=1,CONCATENATE(Tabelle_Auswertung[[#This Row],[Bildname]],\" von \",Tabelle_Auswertung[[#This Row],[Autor(in)]]),\"\")","v":""},{"$f":"IF(Tabelle_Auswertung[[#This Row],[Platz]]=2,CONCATENATE(Tabelle_Auswertung[[#This Row],[Bildname]],\" von \",Tabelle_Auswertung[[#This Row],[Autor(in)]]),\"\")","v":""},{"$f":"IF(Tabelle_Auswertung[[#This Row],[Platz]]=3,CONCATENATE(Tabelle_Auswertung[[#This Row],[Bildname]],\" von \",Tabelle_Auswertung[[#This Row],[Autor(in)]]),\"\")","v":""},{"$f":"IF(Tabelle_Auswertung[[#This Row],[Platz]]=4,CONCATENATE(Tabelle_Auswertung[[#This Row],[Bildname]],\" von \",Tabelle_Auswertung[[#This Row],[Autor(in)]]),\"\")","v":""},{"$f":"IF(Tabelle_Auswertung[[#This Row],[Platz]]=5,CONCATENATE(Tabelle_Auswertung[[#This Row],[Bildname]],\" von \",Tabelle_Auswertung[[#This Row],[Autor(in)]]),\"\")","v":""},{"$f":"IF(Tabelle_Auswertung[[#This Row],[Platz]]=6,CONCATENATE(Tabelle_Auswertung[[#This Row],[Bildname]],\" von \",Tabelle_Auswertung[[#This Row],[Autor(in)]]),\"\")","v":""},{"$f":"IF(Tabelle_Auswertung[[#This Row],[Platz]]=7,CONCATENATE(Tabelle_Auswertung[[#This Row],[Bildname]],\" von \",Tabelle_Auswertung[[#This Row],[Autor(in)]]),\"\")","v":""},{"$f":"IF(Tabelle_Auswertung[[#This Row],[Platz]]=8,CONCATENATE(Tabelle_Auswertung[[#This Row],[Bildname]],\" von \",Tabelle_Auswertung[[#This Row],[Autor(in)]]),\"\")","v":""},{"$f":"IF(Tabelle_Auswertung[[#This Row],[Platz]]=9,CONCATENATE(Tabelle_Auswertung[[#This Row],[Bildname]],\" von \",Tabelle_Auswertung[[#This Row],[Autor(in)]]),\"\")","v":""},{"$f":"IF(Tabelle_Auswertung[[#This Row],[Platz]]=10,CONCATENATE(Tabelle_Auswertung[[#This Row],[Bildname]],\" von \",Tabelle_Auswertung[[#This Row],[Autor(in)]]),\"\")","v":""}]
[60,"unter Wasser.JPG",0,5,4,6,5,3,2,4,{"$nulls":12},{"$f":"IF(Tabelle_Auswertung[[#This Row],[Bildname]]<>\"\",\n    IF(Tabelle_Auswertung[[#This Row],[abwesend]]=\"ja\",\n        SUM(Tabelle_Auswertung[[#This Row],[Juror 1]:[Juror 20]])/COUNT(Tabelle_Auswertung[[#This Row],[Juror 1]:[Juror 20]])*(COUNT(Tabelle_Auswertung[[#This Row],[Juror 1]:[Juror 20]])-1),\n        SUM(Tabelle_Auswertung[[#This Row],[Juror 1]:[Juror 20]])\n    ),\n\" - \")","v":29},{"$f":"IF(Tabelle_Auswertung[[#This Row],[Bildname]]<>\"\",IF(Tabelle_Auswertung[[#This Row],[Punkte]]>0,AVERAGE(Tabelle_Auswertung[[#This Row],[Juror 1]:[Juror 20]]),\" - \"),\" - \")","v":{"v":3.625,"d":"3.63 "}},{"$f":"IF(Tabelle_Auswertung[[#This Row],[Bildname]]<>\"\",IF(Tabelle_Auswertung[[#This Row],[Punkte]]>0,RANK(Tabelle_Auswertung[[#This Row],[Punkte]],[Punkte],0),\" - \"),\" - \")","v":59},"Claudia Dommel",null,{"$f":"IF(Tabelle_Auswertung[[#This Row],[Platz]]=1,CONCATENATE(Tabelle_Auswertung[[#This Row],[Bildname]],\" von \",Tabelle_Auswertung[[#This Row],[Autor(in)]]),\"\")","v":""},{"$f":"IF(Tabelle_Auswertung[[#This Row],[Platz]]=2,CONCATENATE(Tabelle_Auswertung[[#This Row],[Bildname]],\" von \",Tabelle_Auswertung[[#This Row],[Autor(in)]]),\"\")","v":""},{"$f":"IF(Tabelle_Auswertung[[#This Row],[Platz]]=3,CONCATENATE(Tabelle_Auswertung[[#This Row],[Bildname]],\" von \",Tabelle_Auswertung[[#This Row],[Autor(in)]]),\"\")","v":""},{"$f":"IF(Tabelle_Auswertung[[#This Row],[Platz]]=4,CONCATENATE(Tabelle_Auswertung[[#This Row],[Bildname]],\" von \",Tabelle_Auswertung[[#This Row],[Autor(in)]]),\"\")","v":""},{"$f":"IF(Tabelle_Auswertung[[#This Row],[Platz]]=5,CONCATENATE(Tabelle_Auswertung[[#This Row],[Bildname]],\" von \",Tabelle_Auswertung[[#This Row],[Autor(in)]]),\"\")","v":""},{"$f":"IF(Tabelle_Auswertung[[#This Row],[Platz]]=6,CONCATENATE(Tabelle_Auswertung[[#This Row],[Bildname]],\" von \",Tabelle_Auswertung[[#This Row],[Autor(in)]]),\"\")","v":""},{"$f":"IF(Tabelle_Auswertung[[#This Row],[Platz]]=7,CONCATENATE(Tabelle_Auswertung[[#This Row],[Bildname]],\" von \",Tabelle_Auswertung[[#This Row],[Autor(in)]]),\"\")","v":""},{"$f":"IF(Tabelle_Auswertung[[#This Row],[Platz]]=8,CONCATENATE(Tabelle_Auswertung[[#This Row],[Bildname]],\" von \",Tabelle_Auswertung[[#This Row],[Autor(in)]]),\"\")","v":""},{"$f":"IF(Tabelle_Auswertung[[#This Row],[Platz]]=9,CONCATENATE(Tabelle_Auswertung[[#This Row],[Bildname]],\" von \",Tabelle_Auswertung[[#This Row],[Autor(in)]]),\"\")","v":""},{"$f":"IF(Tabelle_Auswertung[[#This Row],[Platz]]=10,CONCATENATE(Tabelle_Auswertung[[#This Row],[Bildname]],\" von \",Tabelle_Auswertung[[#This Row],[Autor(in)]]),\"\")","v":""}]
[61,{"$nulls":21},{"$f":"IF(Tabelle_Auswertung[[#This Row],[Bildname]]<>\"\",\n    IF(Tabelle_Auswertung[[#This Row],[abwesend]]=\"ja\",\n        SUM(Tabelle_Auswertung[[#This Row],[Juror 1]:[Juror 20]])/COUNT(Tabelle_Auswertung[[#This Row],[Juror 1]:[Juror 20]])*(COUNT(Tabelle_Auswertung[[#This Row],[Juror 1]:[Juror 20]])-1),\n        SUM(Tabelle_Auswertung[[#This Row],[Juror 1]:[Juror 20]])\n    ),\n\" - \")","v":" - "},{"$f":"IF(Tabelle_Auswertung[[#This Row],[Bildname]]<>\"\",IF(Tabelle_Auswertung[[#This Row],[Punkte]]>0,AVERAGE(Tabelle_Auswertung[[#This Row],[Juror 1]:[Juror 20]]),\" - \"),\" - \")","v":" - "},{"$f":"IF(Tabelle_Auswertung[[#This Row],[Bildname]]<>\"\",IF(Tabelle_Auswertung[[#This Row],[Punkte]]>0,RANK(Tabelle_Auswertung[[#This Row],[Punkte]],[Punkte],0),\" - \"),\" - \")","v":" - "}," - - -",null,{"$f":"IF(Tabelle_Auswertung[[#This Row],[Platz]]=1,CONCATENATE(Tabelle_Auswertung[[#This Row],[Bildname]],\" von \",Tabelle_Auswertung[[#This Row],[Autor(in)]]),\"\")","v":""},{"$f":"IF(Tabelle_Auswertung[[#This Row],[Platz]]=2,CONCATENATE(Tabelle_Auswertung[[#This Row],[Bildname]],\" von \",Tabelle_Auswertung[[#This Row],[Autor(in)]]),\"\")","v":""},{"$f":"IF(Tabelle_Auswertung[[#This Row],[Platz]]=3,CONCATENATE(Tabelle_Auswertung[[#This Row],[Bildname]],\" von \",Tabelle_Auswertung[[#This Row],[Autor(in)]]),\"\")","v":""},{"$f":"IF(Tabelle_Auswertung[[#This Row],[Platz]]=4,CONCATENATE(Tabelle_Auswertung[[#This Row],[Bildname]],\" von \",Tabelle_Auswertung[[#This Row],[Autor(in)]]),\"\")","v":""},{"$f":"IF(Tabelle_Auswertung[[#This Row],[Platz]]=5,CONCATENATE(Tabelle_Auswertung[[#This Row],[Bildname]],\" von \",Tabelle_Auswertung[[#This Row],[Autor(in)]]),\"\")","v":""},{"$f":"IF(Tabelle_Auswertung[[#This Row],[Platz]]=6,CONCATENATE(Tabelle_Auswertung[[#This Row],[Bildname]],\" von \",Tabelle_Auswertung[[#This Row],[Autor(in)]]),\"\")","v":""},{"$f":"IF(Tabelle_Auswertung[[#This Row],[Platz]]=7,CONCATENATE(Tabelle_Auswertung[[#This Row],[Bildname]],\" von \",Tabelle_Auswertung[[#This Row],[Autor(in)]]),\"\")","v":""},{"$f":"IF(Tabelle_Auswertung[[#This Row],[Platz]]=8,CONCATENATE(Tabelle_Auswertung[[#This Row],[Bildname]],\" von \",Tabelle_Auswertung[[#This Row],[Autor(in)]]),\"\")","v":""},{"$f":"IF(Tabelle_Auswertung[[#This Row],[Platz]]=9,CONCATENATE(Tabelle_Auswertung[[#This Row],[Bildname]],\" von \",Tabelle_Auswertung[[#This Row],[Autor(in)]]),\"\")","v":""},{"$f":"IF(Tabelle_Auswertung[[#This Row],[Platz]]=10,CONCATENATE(Tabelle_Auswertung[[#This Row],[Bildname]],\" von \",Tabelle_Auswertung[[#This Row],[Autor(in)]]),\"\")","v":""}]
[62,{"$nulls":21},{"$f":"IF(Tabelle_Auswertung[[#This Row],[Bildname]]<>\"\",\n    IF(Tabelle_Auswertung[[#This Row],[abwesend]]=\"ja\",\n        SUM(Tabelle_Auswertung[[#This Row],[Juror 1]:[Juror 20]])/COUNT(Tabelle_Auswertung[[#This Row],[Juror 1]:[Juror 20]])*(COUNT(Tabelle_Auswertung[[#This Row],[Juror 1]:[Juror 20]])-1),\n        SUM(Tabelle_Auswertung[[#This Row],[Juror 1]:[Juror 20]])\n    ),\n\" - \")","v":" - "},{"$f":"IF(Tabelle_Auswertung[[#This Row],[Bildname]]<>\"\",IF(Tabelle_Auswertung[[#This Row],[Punkte]]>0,AVERAGE(Tabelle_Auswertung[[#This Row],[Juror 1]:[Juror 20]]),\" - \"),\" - \")","v":" - "},{"$f":"IF(Tabelle_Auswertung[[#This Row],[Bildname]]<>\"\",IF(Tabelle_Auswertung[[#This Row],[Punkte]]>0,RANK(Tabelle_Auswertung[[#This Row],[Punkte]],[Punkte],0),\" - \"),\" - \")","v":" - "}," - - -",null,{"$f":"IF(Tabelle_Auswertung[[#This Row],[Platz]]=1,CONCATENATE(Tabelle_Auswertung[[#This Row],[Bildname]],\" von \",Tabelle_Auswertung[[#This Row],[Autor(in)]]),\"\")","v":""},{"$f":"IF(Tabelle_Auswertung[[#This Row],[Platz]]=2,CONCATENATE(Tabelle_Auswertung[[#This Row],[Bildname]],\" von \",Tabelle_Auswertung[[#This Row],[Autor(in)]]),\"\")","v":""},{"$f":"IF(Tabelle_Auswertung[[#This Row],[Platz]]=3,CONCATENATE(Tabelle_Auswertung[[#This Row],[Bildname]],\" von \",Tabelle_Auswertung[[#This Row],[Autor(in)]]),\"\")","v":""},{"$f":"IF(Tabelle_Auswertung[[#This Row],[Platz]]=4,CONCATENATE(Tabelle_Auswertung[[#This Row],[Bildname]],\" von \",Tabelle_Auswertung[[#This Row],[Autor(in)]]),\"\")","v":""},{"$f":"IF(Tabelle_Auswertung[[#This Row],[Platz]]=5,CONCATENATE(Tabelle_Auswertung[[#This Row],[Bildname]],\" von \",Tabelle_Auswertung[[#This Row],[Autor(in)]]),\"\")","v":""},{"$f":"IF(Tabelle_Auswertung[[#This Row],[Platz]]=6,CONCATENATE(Tabelle_Auswertung[[#This Row],[Bildname]],\" von \",Tabelle_Auswertung[[#This Row],[Autor(in)]]),\"\")","v":""},{"$f":"IF(Tabelle_Auswertung[[#This Row],[Platz]]=7,CONCATENATE(Tabelle_Auswertung[[#This Row],[Bildname]],\" von \",Tabelle_Auswertung[[#This Row],[Autor(in)]]),\"\")","v":""},{"$f":"IF(Tabelle_Auswertung[[#This Row],[Platz]]=8,CONCATENATE(Tabelle_Auswertung[[#This Row],[Bildname]],\" von \",Tabelle_Auswertung[[#This Row],[Autor(in)]]),\"\")","v":""},{"$f":"IF(Tabelle_Auswertung[[#This Row],[Platz]]=9,CONCATENATE(Tabelle_Auswertung[[#This Row],[Bildname]],\" von \",Tabelle_Auswertung[[#This Row],[Autor(in)]]),\"\")","v":""},{"$f":"IF(Tabelle_Auswertung[[#This Row],[Platz]]=10,CONCATENATE(Tabelle_Auswertung[[#This Row],[Bildname]],\" von \",Tabelle_Auswertung[[#This Row],[Autor(in)]]),\"\")","v":""}]
[63,{"$nulls":21},{"$f":"IF(Tabelle_Auswertung[[#This Row],[Bildname]]<>\"\",\n    IF(Tabelle_Auswertung[[#This Row],[abwesend]]=\"ja\",\n        SUM(Tabelle_Auswertung[[#This Row],[Juror 1]:[Juror 20]])/COUNT(Tabelle_Auswertung[[#This Row],[Juror 1]:[Juror 20]])*(COUNT(Tabelle_Auswertung[[#This Row],[Juror 1]:[Juror 20]])-1),\n        SUM(Tabelle_Auswertung[[#This Row],[Juror 1]:[Juror 20]])\n    ),\n\" - \")","v":" - "},{"$f":"IF(Tabelle_Auswertung[[#This Row],[Bildname]]<>\"\",IF(Tabelle_Auswertung[[#This Row],[Punkte]]>0,AVERAGE(Tabelle_Auswertung[[#This Row],[Juror 1]:[Juror 20]]),\" - \"),\" - \")","v":" - "},{"$f":"IF(Tabelle_Auswertung[[#This Row],[Bildname]]<>\"\",IF(Tabelle_Auswertung[[#This Row],[Punkte]]>0,RANK(Tabelle_Auswertung[[#This Row],[Punkte]],[Punkte],0),\" - \"),\" - \")","v":" - "}," - - -",null,{"$f":"IF(Tabelle_Auswertung[[#This Row],[Platz]]=1,CONCATENATE(Tabelle_Auswertung[[#This Row],[Bildname]],\" von \",Tabelle_Auswertung[[#This Row],[Autor(in)]]),\"\")","v":""},{"$f":"IF(Tabelle_Auswertung[[#This Row],[Platz]]=2,CONCATENATE(Tabelle_Auswertung[[#This Row],[Bildname]],\" von \",Tabelle_Auswertung[[#This Row],[Autor(in)]]),\"\")","v":""},{"$f":"IF(Tabelle_Auswertung[[#This Row],[Platz]]=3,CONCATENATE(Tabelle_Auswertung[[#This Row],[Bildname]],\" von \",Tabelle_Auswertung[[#This Row],[Autor(in)]]),\"\")","v":""},{"$f":"IF(Tabelle_Auswertung[[#This Row],[Platz]]=4,CONCATENATE(Tabelle_Auswertung[[#This Row],[Bildname]],\" von \",Tabelle_Auswertung[[#This Row],[Autor(in)]]),\"\")","v":""},{"$f":"IF(Tabelle_Auswertung[[#This Row],[Platz]]=5,CONCATENATE(Tabelle_Auswertung[[#This Row],[Bildname]],\" von \",Tabelle_Auswertung[[#This Row],[Autor(in)]]),\"\")","v":""},{"$f":"IF(Tabelle_Auswertung[[#This Row],[Platz]]=6,CONCATENATE(Tabelle_Auswertung[[#This Row],[Bildname]],\" von \",Tabelle_Auswertung[[#This Row],[Autor(in)]]),\"\")","v":""},{"$f":"IF(Tabelle_Auswertung[[#This Row],[Platz]]=7,CONCATENATE(Tabelle_Auswertung[[#This Row],[Bildname]],\" von \",Tabelle_Auswertung[[#This Row],[Autor(in)]]),\"\")","v":""},{"$f":"IF(Tabelle_Auswertung[[#This Row],[Platz]]=8,CONCATENATE(Tabelle_Auswertung[[#This Row],[Bildname]],\" von \",Tabelle_Auswertung[[#This Row],[Autor(in)]]),\"\")","v":""},{"$f":"IF(Tabelle_Auswertung[[#This Row],[Platz]]=9,CONCATENATE(Tabelle_Auswertung[[#This Row],[Bildname]],\" von \",Tabelle_Auswertung[[#This Row],[Autor(in)]]),\"\")","v":""},{"$f":"IF(Tabelle_Auswertung[[#This Row],[Platz]]=10,CONCATENATE(Tabelle_Auswertung[[#This Row],[Bildname]],\" von \",Tabelle_Auswertung[[#This Row],[Autor(in)]]),\"\")","v":""}]
[64,{"$nulls":21},{"$f":"IF(Tabelle_Auswertung[[#This Row],[Bildname]]<>\"\",\n    IF(Tabelle_Auswertung[[#This Row],[abwesend]]=\"ja\",\n        SUM(Tabelle_Auswertung[[#This Row],[Juror 1]:[Juror 20]])/COUNT(Tabelle_Auswertung[[#This Row],[Juror 1]:[Juror 20]])*(COUNT(Tabelle_Auswertung[[#This Row],[Juror 1]:[Juror 20]])-1),\n        SUM(Tabelle_Auswertung[[#This Row],[Juror 1]:[Juror 20]])\n    ),\n\" - \")","v":" - "},{"$f":"IF(Tabelle_Auswertung[[#This Row],[Bildname]]<>\"\",IF(Tabelle_Auswertung[[#This Row],[Punkte]]>0,AVERAGE(Tabelle_Auswertung[[#This Row],[Juror 1]:[Juror 20]]),\" - \"),\" - \")","v":" - "},{"$f":"IF(Tabelle_Auswertung[[#This Row],[Bildname]]<>\"\",IF(Tabelle_Auswertung[[#This Row],[Punkte]]>0,RANK(Tabelle_Auswertung[[#This Row],[Punkte]],[Punkte],0),\" - \"),\" - \")","v":" - "}," - - -",null,{"$f":"IF(Tabelle_Auswertung[[#This Row],[Platz]]=1,CONCATENATE(Tabelle_Auswertung[[#This Row],[Bildname]],\" von \",Tabelle_Auswertung[[#This Row],[Autor(in)]]),\"\")","v":""},{"$f":"IF(Tabelle_Auswertung[[#This Row],[Platz]]=2,CONCATENATE(Tabelle_Auswertung[[#This Row],[Bildname]],\" von \",Tabelle_Auswertung[[#This Row],[Autor(in)]]),\"\")","v":""},{"$f":"IF(Tabelle_Auswertung[[#This Row],[Platz]]=3,CONCATENATE(Tabelle_Auswertung[[#This Row],[Bildname]],\" von \",Tabelle_Auswertung[[#This Row],[Autor(in)]]),\"\")","v":""},{"$f":"IF(Tabelle_Auswertung[[#This Row],[Platz]]=4,CONCATENATE(Tabelle_Auswertung[[#This Row],[Bildname]],\" von \",Tabelle_Auswertung[[#This Row],[Autor(in)]]),\"\")","v":""},{"$f":"IF(Tabelle_Auswertung[[#This Row],[Platz]]=5,CONCATENATE(Tabelle_Auswertung[[#This Row],[Bildname]],\" von \",Tabelle_Auswertung[[#This Row],[Autor(in)]]),\"\")","v":""},{"$f":"IF(Tabelle_Auswertung[[#This Row],[Platz]]=6,CONCATENATE(Tabelle_Auswertung[[#This Row],[Bildname]],\" von \",Tabelle_Auswertung[[#This Row],[Autor(in)]]),\"\")","v":""},{"$f":"IF(Tabelle_Auswertung[[#This Row],[Platz]]=7,CONCATENATE(Tabelle_Auswertung[[#This Row],[Bildname]],\" von \",Tabelle_Auswertung[[#This Row],[Autor(in)]]),\"\")","v":""},{"$f":"IF(Tabelle_Auswertung[[#This Row],[Platz]]=8,CONCATENATE(Tabelle_Auswertung[[#This Row],[Bildname]],\" von \",Tabelle_Auswertung[[#This Row],[Autor(in)]]),\"\")","v":""},{"$f":"IF(Tabelle_Auswertung[[#This Row],[Platz]]=9,CONCATENATE(Tabelle_Auswertung[[#This Row],[Bildname]],\" von \",Tabelle_Auswertung[[#This Row],[Autor(in)]]),\"\")","v":""},{"$f":"IF(Tabelle_Auswertung[[#This Row],[Platz]]=10,CONCATENATE(Tabelle_Auswertung[[#This Row],[Bildname]],\" von \",Tabelle_Auswertung[[#This Row],[Autor(in)]]),\"\")","v":""}]
[65,{"$nulls":21},{"$f":"IF(Tabelle_Auswertung[[#This Row],[Bildname]]<>\"\",\n    IF(Tabelle_Auswertung[[#This Row],[abwesend]]=\"ja\",\n        SUM(Tabelle_Auswertung[[#This Row],[Juror 1]:[Juror 20]])/COUNT(Tabelle_Auswertung[[#This Row],[Juror 1]:[Juror 20]])*(COUNT(Tabelle_Auswertung[[#This Row],[Juror 1]:[Juror 20]])-1),\n        SUM(Tabelle_Auswertung[[#This Row],[Juror 1]:[Juror 20]])\n    ),\n\" - \")","v":" - "},{"$f":"IF(Tabelle_Auswertung[[#This Row],[Bildname]]<>\"\",IF(Tabelle_Auswertung[[#This Row],[Punkte]]>0,AVERAGE(Tabelle_Auswertung[[#This Row],[Juror 1]:[Juror 20]]),\" - \"),\" - \")","v":" - "},{"$f":"IF(Tabelle_Auswertung[[#This Row],[Bildname]]<>\"\",IF(Tabelle_Auswertung[[#This Row],[Punkte]]>0,RANK(Tabelle_Auswertung[[#This Row],[Punkte]],[Punkte],0),\" - \"),\" - \")","v":" - "}," - - -",null,{"$f":"IF(Tabelle_Auswertung[[#This Row],[Platz]]=1,CONCATENATE(Tabelle_Auswertung[[#This Row],[Bildname]],\" von \",Tabelle_Auswertung[[#This Row],[Autor(in)]]),\"\")","v":""},{"$f":"IF(Tabelle_Auswertung[[#This Row],[Platz]]=2,CONCATENATE(Tabelle_Auswertung[[#This Row],[Bildname]],\" von \",Tabelle_Auswertung[[#This Row],[Autor(in)]]),\"\")","v":""},{"$f":"IF(Tabelle_Auswertung[[#This Row],[Platz]]=3,CONCATENATE(Tabelle_Auswertung[[#This Row],[Bildname]],\" von \",Tabelle_Auswertung[[#This Row],[Autor(in)]]),\"\")","v":""},{"$f":"IF(Tabelle_Auswertung[[#This Row],[Platz]]=4,CONCATENATE(Tabelle_Auswertung[[#This Row],[Bildname]],\" von \",Tabelle_Auswertung[[#This Row],[Autor(in)]]),\"\")","v":""},{"$f":"IF(Tabelle_Auswertung[[#This Row],[Platz]]=5,CONCATENATE(Tabelle_Auswertung[[#This Row],[Bildname]],\" von \",Tabelle_Auswertung[[#This Row],[Autor(in)]]),\"\")","v":""},{"$f":"IF(Tabelle_Auswertung[[#This Row],[Platz]]=6,CONCATENATE(Tabelle_Auswertung[[#This Row],[Bildname]],\" von \",Tabelle_Auswertung[[#This Row],[Autor(in)]]),\"\")","v":""},{"$f":"IF(Tabelle_Auswertung[[#This Row],[Platz]]=7,CONCATENATE(Tabelle_Auswertung[[#This Row],[Bildname]],\" von \",Tabelle_Auswertung[[#This Row],[Autor(in)]]),\"\")","v":""},{"$f":"IF(Tabelle_Auswertung[[#This Row],[Platz]]=8,CONCATENATE(Tabelle_Auswertung[[#This Row],[Bildname]],\" von \",Tabelle_Auswertung[[#This Row],[Autor(in)]]),\"\")","v":""},{"$f":"IF(Tabelle_Auswertung[[#This Row],[Platz]]=9,CONCATENATE(Tabelle_Auswertung[[#This Row],[Bildname]],\" von \",Tabelle_Auswertung[[#This Row],[Autor(in)]]),\"\")","v":""},{"$f":"IF(Tabelle_Auswertung[[#This Row],[Platz]]=10,CONCATENATE(Tabelle_Auswertung[[#This Row],[Bildname]],\" von \",Tabelle_Auswertung[[#This Row],[Autor(in)]]),\"\")","v":""}]
[66,{"$nulls":21},{"$f":"IF(Tabelle_Auswertung[[#This Row],[Bildname]]<>\"\",\n    IF(Tabelle_Auswertung[[#This Row],[abwesend]]=\"ja\",\n        SUM(Tabelle_Auswertung[[#This Row],[Juror 1]:[Juror 20]])/COUNT(Tabelle_Auswertung[[#This Row],[Juror 1]:[Juror 20]])*(COUNT(Tabelle_Auswertung[[#This Row],[Juror 1]:[Juror 20]])-1),\n        SUM(Tabelle_Auswertung[[#This Row],[Juror 1]:[Juror 20]])\n    ),\n\" - \")","v":" - "},{"$f":"IF(Tabelle_Auswertung[[#This Row],[Bildname]]<>\"\",IF(Tabelle_Auswertung[[#This Row],[Punkte]]>0,AVERAGE(Tabelle_Auswertung[[#This Row],[Juror 1]:[Juror 20]]),\" - \"),\" - \")","v":" - "},{"$f":"IF(Tabelle_Auswertung[[#This Row],[Bildname]]<>\"\",IF(Tabelle_Auswertung[[#This Row],[Punkte]]>0,RANK(Tabelle_Auswertung[[#This Row],[Punkte]],[Punkte],0),\" - \"),\" - \")","v":" - "}," - - -",null,{"$f":"IF(Tabelle_Auswertung[[#This Row],[Platz]]=1,CONCATENATE(Tabelle_Auswertung[[#This Row],[Bildname]],\" von \",Tabelle_Auswertung[[#This Row],[Autor(in)]]),\"\")","v":""},{"$f":"IF(Tabelle_Auswertung[[#This Row],[Platz]]=2,CONCATENATE(Tabelle_Auswertung[[#This Row],[Bildname]],\" von \",Tabelle_Auswertung[[#This Row],[Autor(in)]]),\"\")","v":""},{"$f":"IF(Tabelle_Auswertung[[#This Row],[Platz]]=3,CONCATENATE(Tabelle_Auswertung[[#This Row],[Bildname]],\" von \",Tabelle_Auswertung[[#This Row],[Autor(in)]]),\"\")","v":""},{"$f":"IF(Tabelle_Auswertung[[#This Row],[Platz]]=4,CONCATENATE(Tabelle_Auswertung[[#This Row],[Bildname]],\" von \",Tabelle_Auswertung[[#This Row],[Autor(in)]]),\"\")","v":""},{"$f":"IF(Tabelle_Auswertung[[#This Row],[Platz]]=5,CONCATENATE(Tabelle_Auswertung[[#This Row],[Bildname]],\" von \",Tabelle_Auswertung[[#This Row],[Autor(in)]]),\"\")","v":""},{"$f":"IF(Tabelle_Auswertung[[#This Row],[Platz]]=6,CONCATENATE(Tabelle_Auswertung[[#This Row],[Bildname]],\" von \",Tabelle_Auswertung[[#This Row],[Autor(in)]]),\"\")","v":""},{"$f":"IF(Tabelle_Auswertung[[#This Row],[Platz]]=7,CONCATENATE(Tabelle_Auswertung[[#This Row],[Bildname]],\" von \",Tabelle_Auswertung[[#This Row],[Autor(in)]]),\"\")","v":""},{"$f":"IF(Tabelle_Auswertung[[#This Row],[Platz]]=8,CONCATENATE(Tabelle_Auswertung[[#This Row],[Bildname]],\" von \",Tabelle_Auswertung[[#This Row],[Autor(in)]]),\"\")","v":""},{"$f":"IF(Tabelle_Auswertung[[#This Row],[Platz]]=9,CONCATENATE(Tabelle_Auswertung[[#This Row],[Bildname]],\" von \",Tabelle_Auswertung[[#This Row],[Autor(in)]]),\"\")","v":""},{"$f":"IF(Tabelle_Auswertung[[#This Row],[Platz]]=10,CONCATENATE(Tabelle_Auswertung[[#This Row],[Bildname]],\" von \",Tabelle_Auswertung[[#This Row],[Autor(in)]]),\"\")","v":""}]
[67,{"$nulls":21},{"$f":"IF(Tabelle_Auswertung[[#This Row],[Bildname]]<>\"\",\n    IF(Tabelle_Auswertung[[#This Row],[abwesend]]=\"ja\",\n        SUM(Tabelle_Auswertung[[#This Row],[Juror 1]:[Juror 20]])/COUNT(Tabelle_Auswertung[[#This Row],[Juror 1]:[Juror 20]])*(COUNT(Tabelle_Auswertung[[#This Row],[Juror 1]:[Juror 20]])-1),\n        SUM(Tabelle_Auswertung[[#This Row],[Juror 1]:[Juror 20]])\n    ),\n\" - \")","v":" - "},{"$f":"IF(Tabelle_Auswertung[[#This Row],[Bildname]]<>\"\",IF(Tabelle_Auswertung[[#This Row],[Punkte]]>0,AVERAGE(Tabelle_Auswertung[[#This Row],[Juror 1]:[Juror 20]]),\" - \"),\" - \")","v":" - "},{"$f":"IF(Tabelle_Auswertung[[#This Row],[Bildname]]<>\"\",IF(Tabelle_Auswertung[[#This Row],[Punkte]]>0,RANK(Tabelle_Auswertung[[#This Row],[Punkte]],[Punkte],0),\" - \"),\" - \")","v":" - "}," - - -",null,{"$f":"IF(Tabelle_Auswertung[[#This Row],[Platz]]=1,CONCATENATE(Tabelle_Auswertung[[#This Row],[Bildname]],\" von \",Tabelle_Auswertung[[#This Row],[Autor(in)]]),\"\")","v":""},{"$f":"IF(Tabelle_Auswertung[[#This Row],[Platz]]=2,CONCATENATE(Tabelle_Auswertung[[#This Row],[Bildname]],\" von \",Tabelle_Auswertung[[#This Row],[Autor(in)]]),\"\")","v":""},{"$f":"IF(Tabelle_Auswertung[[#This Row],[Platz]]=3,CONCATENATE(Tabelle_Auswertung[[#This Row],[Bildname]],\" von \",Tabelle_Auswertung[[#This Row],[Autor(in)]]),\"\")","v":""},{"$f":"IF(Tabelle_Auswertung[[#This Row],[Platz]]=4,CONCATENATE(Tabelle_Auswertung[[#This Row],[Bildname]],\" von \",Tabelle_Auswertung[[#This Row],[Autor(in)]]),\"\")","v":""},{"$f":"IF(Tabelle_Auswertung[[#This Row],[Platz]]=5,CONCATENATE(Tabelle_Auswertung[[#This Row],[Bildname]],\" von \",Tabelle_Auswertung[[#This Row],[Autor(in)]]),\"\")","v":""},{"$f":"IF(Tabelle_Auswertung[[#This Row],[Platz]]=6,CONCATENATE(Tabelle_Auswertung[[#This Row],[Bildname]],\" von \",Tabelle_Auswertung[[#This Row],[Autor(in)]]),\"\")","v":""},{"$f":"IF(Tabelle_Auswertung[[#This Row],[Platz]]=7,CONCATENATE(Tabelle_Auswertung[[#This Row],[Bildname]],\" von \",Tabelle_Auswertung[[#This Row],[Autor(in)]]),\"\")","v":""},{"$f":"IF(Tabelle_Auswertung[[#This Row],[Platz]]=8,CONCATENATE(Tabelle_Auswertung[[#This Row],[Bildname]],\" von \",Tabelle_Auswertung[[#This Row],[Autor(in)]]),\"\")","v":""},{"$f":"IF(Tabelle_Auswertung[[#This Row],[Platz]]=9,CONCATENATE(Tabelle_Auswertung[[#This Row],[Bildname]],\" von \",Tabelle_Auswertung[[#This Row],[Autor(in)]]),\"\")","v":""},{"$f":"IF(Tabelle_Auswertung[[#This Row],[Platz]]=10,CONCATENATE(Tabelle_Auswertung[[#This Row],[Bildname]],\" von \",Tabelle_Auswertung[[#This Row],[Autor(in)]]),\"\")","v":""}]
[68,{"$nulls":21},{"$f":"IF(Tabelle_Auswertung[[#This Row],[Bildname]]<>\"\",\n    IF(Tabelle_Auswertung[[#This Row],[abwesend]]=\"ja\",\n        SUM(Tabelle_Auswertung[[#This Row],[Juror 1]:[Juror 20]])/COUNT(Tabelle_Auswertung[[#This Row],[Juror 1]:[Juror 20]])*(COUNT(Tabelle_Auswertung[[#This Row],[Juror 1]:[Juror 20]])-1),\n        SUM(Tabelle_Auswertung[[#This Row],[Juror 1]:[Juror 20]])\n    ),\n\" - \")","v":" - "},{"$f":"IF(Tabelle_Auswertung[[#This Row],[Bildname]]<>\"\",IF(Tabelle_Auswertung[[#This Row],[Punkte]]>0,AVERAGE(Tabelle_Auswertung[[#This Row],[Juror 1]:[Juror 20]]),\" - \"),\" - \")","v":" - "},{"$f":"IF(Tabelle_Auswertung[[#This Row],[Bildname]]<>\"\",IF(Tabelle_Auswertung[[#This Row],[Punkte]]>0,RANK(Tabelle_Auswertung[[#This Row],[Punkte]],[Punkte],0),\" - \"),\" - \")","v":" - "}," - - -",null,{"$f":"IF(Tabelle_Auswertung[[#This Row],[Platz]]=1,CONCATENATE(Tabelle_Auswertung[[#This Row],[Bildname]],\" von \",Tabelle_Auswertung[[#This Row],[Autor(in)]]),\"\")","v":""},{"$f":"IF(Tabelle_Auswertung[[#This Row],[Platz]]=2,CONCATENATE(Tabelle_Auswertung[[#This Row],[Bildname]],\" von \",Tabelle_Auswertung[[#This Row],[Autor(in)]]),\"\")","v":""},{"$f":"IF(Tabelle_Auswertung[[#This Row],[Platz]]=3,CONCATENATE(Tabelle_Auswertung[[#This Row],[Bildname]],\" von \",Tabelle_Auswertung[[#This Row],[Autor(in)]]),\"\")","v":""},{"$f":"IF(Tabelle_Auswertung[[#This Row],[Platz]]=4,CONCATENATE(Tabelle_Auswertung[[#This Row],[Bildname]],\" von \",Tabelle_Auswertung[[#This Row],[Autor(in)]]),\"\")","v":""},{"$f":"IF(Tabelle_Auswertung[[#This Row],[Platz]]=5,CONCATENATE(Tabelle_Auswertung[[#This Row],[Bildname]],\" von \",Tabelle_Auswertung[[#This Row],[Autor(in)]]),\"\")","v":""},{"$f":"IF(Tabelle_Auswertung[[#This Row],[Platz]]=6,CONCATENATE(Tabelle_Auswertung[[#This Row],[Bildname]],\" von \",Tabelle_Auswertung[[#This Row],[Autor(in)]]),\"\")","v":""},{"$f":"IF(Tabelle_Auswertung[[#This Row],[Platz]]=7,CONCATENATE(Tabelle_Auswertung[[#This Row],[Bildname]],\" von \",Tabelle_Auswertung[[#This Row],[Autor(in)]]),\"\")","v":""},{"$f":"IF(Tabelle_Auswertung[[#This Row],[Platz]]=8,CONCATENATE(Tabelle_Auswertung[[#This Row],[Bildname]],\" von \",Tabelle_Auswertung[[#This Row],[Autor(in)]]),\"\")","v":""},{"$f":"IF(Tabelle_Auswertung[[#This Row],[Platz]]=9,CONCATENATE(Tabelle_Auswertung[[#This Row],[Bildname]],\" von \",Tabelle_Auswertung[[#This Row],[Autor(in)]]),\"\")","v":""},{"$f":"IF(Tabelle_Auswertung[[#This Row],[Platz]]=10,CONCATENATE(Tabelle_Auswertung[[#This Row],[Bildname]],\" von \",Tabelle_Auswertung[[#This Row],[Autor(in)]]),\"\")","v":""}]
[69,{"$nulls":21},{"$f":"IF(Tabelle_Auswertung[[#This Row],[Bildname]]<>\"\",\n    IF(Tabelle_Auswertung[[#This Row],[abwesend]]=\"ja\",\n        SUM(Tabelle_Auswertung[[#This Row],[Juror 1]:[Juror 20]])/COUNT(Tabelle_Auswertung[[#This Row],[Juror 1]:[Juror 20]])*(COUNT(Tabelle_Auswertung[[#This Row],[Juror 1]:[Juror 20]])-1),\n        SUM(Tabelle_Auswertung[[#This Row],[Juror 1]:[Juror 20]])\n    ),\n\" - \")","v":" - "},{"$f":"IF(Tabelle_Auswertung[[#This Row],[Bildname]]<>\"\",IF(Tabelle_Auswertung[[#This Row],[Punkte]]>0,AVERAGE(Tabelle_Auswertung[[#This Row],[Juror 1]:[Juror 20]]),\" - \"),\" - \")","v":" - "},{"$f":"IF(Tabelle_Auswertung[[#This Row],[Bildname]]<>\"\",IF(Tabelle_Auswertung[[#This Row],[Punkte]]>0,RANK(Tabelle_Auswertung[[#This Row],[Punkte]],[Punkte],0),\" - \"),\" - \")","v":" - "}," - - -",null,{"$f":"IF(Tabelle_Auswertung[[#This Row],[Platz]]=1,CONCATENATE(Tabelle_Auswertung[[#This Row],[Bildname]],\" von \",Tabelle_Auswertung[[#This Row],[Autor(in)]]),\"\")","v":""},{"$f":"IF(Tabelle_Auswertung[[#This Row],[Platz]]=2,CONCATENATE(Tabelle_Auswertung[[#This Row],[Bildname]],\" von \",Tabelle_Auswertung[[#This Row],[Autor(in)]]),\"\")","v":""},{"$f":"IF(Tabelle_Auswertung[[#This Row],[Platz]]=3,CONCATENATE(Tabelle_Auswertung[[#This Row],[Bildname]],\" von \",Tabelle_Auswertung[[#This Row],[Autor(in)]]),\"\")","v":""},{"$f":"IF(Tabelle_Auswertung[[#This Row],[Platz]]=4,CONCATENATE(Tabelle_Auswertung[[#This Row],[Bildname]],\" von \",Tabelle_Auswertung[[#This Row],[Autor(in)]]),\"\")","v":""},{"$f":"IF(Tabelle_Auswertung[[#This Row],[Platz]]=5,CONCATENATE(Tabelle_Auswertung[[#This Row],[Bildname]],\" von \",Tabelle_Auswertung[[#This Row],[Autor(in)]]),\"\")","v":""},{"$f":"IF(Tabelle_Auswertung[[#This Row],[Platz]]=6,CONCATENATE(Tabelle_Auswertung[[#This Row],[Bildname]],\" von \",Tabelle_Auswertung[[#This Row],[Autor(in)]]),\"\")","v":""},{"$f":"IF(Tabelle_Auswertung[[#This Row],[Platz]]=7,CONCATENATE(Tabelle_Auswertung[[#This Row],[Bildname]],\" von \",Tabelle_Auswertung[[#This Row],[Autor(in)]]),\"\")","v":""},{"$f":"IF(Tabelle_Auswertung[[#This Row],[Platz]]=8,CONCATENATE(Tabelle_Auswertung[[#This Row],[Bildname]],\" von \",Tabelle_Auswertung[[#This Row],[Autor(in)]]),\"\")","v":""},{"$f":"IF(Tabelle_Auswertung[[#This Row],[Platz]]=9,CONCATENATE(Tabelle_Auswertung[[#This Row],[Bildname]],\" von \",Tabelle_Auswertung[[#This Row],[Autor(in)]]),\"\")","v":""},{"$f":"IF(Tabelle_Auswertung[[#This Row],[Platz]]=10,CONCATENATE(Tabelle_Auswertung[[#This Row],[Bildname]],\" von \",Tabelle_Auswertung[[#This Row],[Autor(in)]]),\"\")","v":""}]
[70,{"$nulls":21},{"$f":"IF(Tabelle_Auswertung[[#This Row],[Bildname]]<>\"\",\n    IF(Tabelle_Auswertung[[#This Row],[abwesend]]=\"ja\",\n        SUM(Tabelle_Auswertung[[#This Row],[Juror 1]:[Juror 20]])/COUNT(Tabelle_Auswertung[[#This Row],[Juror 1]:[Juror 20]])*(COUNT(Tabelle_Auswertung[[#This Row],[Juror 1]:[Juror 20]])-1),\n        SUM(Tabelle_Auswertung[[#This Row],[Juror 1]:[Juror 20]])\n    ),\n\" - \")","v":" - "},{"$f":"IF(Tabelle_Auswertung[[#This Row],[Bildname]]<>\"\",IF(Tabelle_Auswertung[[#This Row],[Punkte]]>0,AVERAGE(Tabelle_Auswertung[[#This Row],[Juror 1]:[Juror 20]]),\" - \"),\" - \")","v":" - "},{"$f":"IF(Tabelle_Auswertung[[#This Row],[Bildname]]<>\"\",IF(Tabelle_Auswertung[[#This Row],[Punkte]]>0,RANK(Tabelle_Auswertung[[#This Row],[Punkte]],[Punkte],0),\" - \"),\" - \")","v":" - "}," - - -",null,{"$f":"IF(Tabelle_Auswertung[[#This Row],[Platz]]=1,CONCATENATE(Tabelle_Auswertung[[#This Row],[Bildname]],\" von \",Tabelle_Auswertung[[#This Row],[Autor(in)]]),\"\")","v":""},{"$f":"IF(Tabelle_Auswertung[[#This Row],[Platz]]=2,CONCATENATE(Tabelle_Auswertung[[#This Row],[Bildname]],\" von \",Tabelle_Auswertung[[#This Row],[Autor(in)]]),\"\")","v":""},{"$f":"IF(Tabelle_Auswertung[[#This Row],[Platz]]=3,CONCATENATE(Tabelle_Auswertung[[#This Row],[Bildname]],\" von \",Tabelle_Auswertung[[#This Row],[Autor(in)]]),\"\")","v":""},{"$f":"IF(Tabelle_Auswertung[[#This Row],[Platz]]=4,CONCATENATE(Tabelle_Auswertung[[#This Row],[Bildname]],\" von \",Tabelle_Auswertung[[#This Row],[Autor(in)]]),\"\")","v":""},{"$f":"IF(Tabelle_Auswertung[[#This Row],[Platz]]=5,CONCATENATE(Tabelle_Auswertung[[#This Row],[Bildname]],\" von \",Tabelle_Auswertung[[#This Row],[Autor(in)]]),\"\")","v":""},{"$f":"IF(Tabelle_Auswertung[[#This Row],[Platz]]=6,CONCATENATE(Tabelle_Auswertung[[#This Row],[Bildname]],\" von \",Tabelle_Auswertung[[#This Row],[Autor(in)]]),\"\")","v":""},{"$f":"IF(Tabelle_Auswertung[[#This Row],[Platz]]=7,CONCATENATE(Tabelle_Auswertung[[#This Row],[Bildname]],\" von \",Tabelle_Auswertung[[#This Row],[Autor(in)]]),\"\")","v":""},{"$f":"IF(Tabelle_Auswertung[[#This Row],[Platz]]=8,CONCATENATE(Tabelle_Auswertung[[#This Row],[Bildname]],\" von \",Tabelle_Auswertung[[#This Row],[Autor(in)]]),\"\")","v":""},{"$f":"IF(Tabelle_Auswertung[[#This Row],[Platz]]=9,CONCATENATE(Tabelle_Auswertung[[#This Row],[Bildname]],\" von \",Tabelle_Auswertung[[#This Row],[Autor(in)]]),\"\")","v":""},{"$f":"IF(Tabelle_Auswertung[[#This Row],[Platz]]=10,CONCATENATE(Tabelle_Auswertung[[#This Row],[Bildname]],\" von \",Tabelle_Auswertung[[#This Row],[Autor(in)]]),\"\")","v":""}]
[71,{"$nulls":21},{"$f":"IF(Tabelle_Auswertung[[#This Row],[Bildname]]<>\"\",\n    IF(Tabelle_Auswertung[[#This Row],[abwesend]]=\"ja\",\n        SUM(Tabelle_Auswertung[[#This Row],[Juror 1]:[Juror 20]])/COUNT(Tabelle_Auswertung[[#This Row],[Juror 1]:[Juror 20]])*(COUNT(Tabelle_Auswertung[[#This Row],[Juror 1]:[Juror 20]])-1),\n        SUM(Tabelle_Auswertung[[#This Row],[Juror 1]:[Juror 20]])\n    ),\n\" - \")","v":" - "},{"$f":"IF(Tabelle_Auswertung[[#This Row],[Bildname]]<>\"\",IF(Tabelle_Auswertung[[#This Row],[Punkte]]>0,AVERAGE(Tabelle_Auswertung[[#This Row],[Juror 1]:[Juror 20]]),\" - \"),\" - \")","v":" - "},{"$f":"IF(Tabelle_Auswertung[[#This Row],[Bildname]]<>\"\",IF(Tabelle_Auswertung[[#This Row],[Punkte]]>0,RANK(Tabelle_Auswertung[[#This Row],[Punkte]],[Punkte],0),\" - \"),\" - \")","v":" - "}," - - -",null,{"$f":"IF(Tabelle_Auswertung[[#This Row],[Platz]]=1,CONCATENATE(Tabelle_Auswertung[[#This Row],[Bildname]],\" von \",Tabelle_Auswertung[[#This Row],[Autor(in)]]),\"\")","v":""},{"$f":"IF(Tabelle_Auswertung[[#This Row],[Platz]]=2,CONCATENATE(Tabelle_Auswertung[[#This Row],[Bildname]],\" von \",Tabelle_Auswertung[[#This Row],[Autor(in)]]),\"\")","v":""},{"$f":"IF(Tabelle_Auswertung[[#This Row],[Platz]]=3,CONCATENATE(Tabelle_Auswertung[[#This Row],[Bildname]],\" von \",Tabelle_Auswertung[[#This Row],[Autor(in)]]),\"\")","v":""},{"$f":"IF(Tabelle_Auswertung[[#This Row],[Platz]]=4,CONCATENATE(Tabelle_Auswertung[[#This Row],[Bildname]],\" von \",Tabelle_Auswertung[[#This Row],[Autor(in)]]),\"\")","v":""},{"$f":"IF(Tabelle_Auswertung[[#This Row],[Platz]]=5,CONCATENATE(Tabelle_Auswertung[[#This Row],[Bildname]],\" von \",Tabelle_Auswertung[[#This Row],[Autor(in)]]),\"\")","v":""},{"$f":"IF(Tabelle_Auswertung[[#This Row],[Platz]]=6,CONCATENATE(Tabelle_Auswertung[[#This Row],[Bildname]],\" von \",Tabelle_Auswertung[[#This Row],[Autor(in)]]),\"\")","v":""},{"$f":"IF(Tabelle_Auswertung[[#This Row],[Platz]]=7,CONCATENATE(Tabelle_Auswertung[[#This Row],[Bildname]],\" von \",Tabelle_Auswertung[[#This Row],[Autor(in)]]),\"\")","v":""},{"$f":"IF(Tabelle_Auswertung[[#This Row],[Platz]]=8,CONCATENATE(Tabelle_Auswertung[[#This Row],[Bildname]],\" von \",Tabelle_Auswertung[[#This Row],[Autor(in)]]),\"\")","v":""},{"$f":"IF(Tabelle_Auswertung[[#This Row],[Platz]]=9,CONCATENATE(Tabelle_Auswertung[[#This Row],[Bildname]],\" von \",Tabelle_Auswertung[[#This Row],[Autor(in)]]),\"\")","v":""},{"$f":"IF(Tabelle_Auswertung[[#This Row],[Platz]]=10,CONCATENATE(Tabelle_Auswertung[[#This Row],[Bildname]],\" von \",Tabelle_Auswertung[[#This Row],[Autor(in)]]),\"\")","v":""}]
[72,{"$nulls":21},{"$f":"IF(Tabelle_Auswertung[[#This Row],[Bildname]]<>\"\",\n    IF(Tabelle_Auswertung[[#This Row],[abwesend]]=\"ja\",\n        SUM(Tabelle_Auswertung[[#This Row],[Juror 1]:[Juror 20]])/COUNT(Tabelle_Auswertung[[#This Row],[Juror 1]:[Juror 20]])*(COUNT(Tabelle_Auswertung[[#This Row],[Juror 1]:[Juror 20]])-1),\n        SUM(Tabelle_Auswertung[[#This Row],[Juror 1]:[Juror 20]])\n    ),\n\" - \")","v":" - "},{"$f":"IF(Tabelle_Auswertung[[#This Row],[Bildname]]<>\"\",IF(Tabelle_Auswertung[[#This Row],[Punkte]]>0,AVERAGE(Tabelle_Auswertung[[#This Row],[Juror 1]:[Juror 20]]),\" - \"),\" - \")","v":" - "},{"$f":"IF(Tabelle_Auswertung[[#This Row],[Bildname]]<>\"\",IF(Tabelle_Auswertung[[#This Row],[Punkte]]>0,RANK(Tabelle_Auswertung[[#This Row],[Punkte]],[Punkte],0),\" - \"),\" - \")","v":" - "}," - - -",null,{"$f":"IF(Tabelle_Auswertung[[#This Row],[Platz]]=1,CONCATENATE(Tabelle_Auswertung[[#This Row],[Bildname]],\" von \",Tabelle_Auswertung[[#This Row],[Autor(in)]]),\"\")","v":""},{"$f":"IF(Tabelle_Auswertung[[#This Row],[Platz]]=2,CONCATENATE(Tabelle_Auswertung[[#This Row],[Bildname]],\" von \",Tabelle_Auswertung[[#This Row],[Autor(in)]]),\"\")","v":""},{"$f":"IF(Tabelle_Auswertung[[#This Row],[Platz]]=3,CONCATENATE(Tabelle_Auswertung[[#This Row],[Bildname]],\" von \",Tabelle_Auswertung[[#This Row],[Autor(in)]]),\"\")","v":""},{"$f":"IF(Tabelle_Auswertung[[#This Row],[Platz]]=4,CONCATENATE(Tabelle_Auswertung[[#This Row],[Bildname]],\" von \",Tabelle_Auswertung[[#This Row],[Autor(in)]]),\"\")","v":""},{"$f":"IF(Tabelle_Auswertung[[#This Row],[Platz]]=5,CONCATENATE(Tabelle_Auswertung[[#This Row],[Bildname]],\" von \",Tabelle_Auswertung[[#This Row],[Autor(in)]]),\"\")","v":""},{"$f":"IF(Tabelle_Auswertung[[#This Row],[Platz]]=6,CONCATENATE(Tabelle_Auswertung[[#This Row],[Bildname]],\" von \",Tabelle_Auswertung[[#This Row],[Autor(in)]]),\"\")","v":""},{"$f":"IF(Tabelle_Auswertung[[#This Row],[Platz]]=7,CONCATENATE(Tabelle_Auswertung[[#This Row],[Bildname]],\" von \",Tabelle_Auswertung[[#This Row],[Autor(in)]]),\"\")","v":""},{"$f":"IF(Tabelle_Auswertung[[#This Row],[Platz]]=8,CONCATENATE(Tabelle_Auswertung[[#This Row],[Bildname]],\" von \",Tabelle_Auswertung[[#This Row],[Autor(in)]]),\"\")","v":""},{"$f":"IF(Tabelle_Auswertung[[#This Row],[Platz]]=9,CONCATENATE(Tabelle_Auswertung[[#This Row],[Bildname]],\" von \",Tabelle_Auswertung[[#This Row],[Autor(in)]]),\"\")","v":""},{"$f":"IF(Tabelle_Auswertung[[#This Row],[Platz]]=10,CONCATENATE(Tabelle_Auswertung[[#This Row],[Bildname]],\" von \",Tabelle_Auswertung[[#This Row],[Autor(in)]]),\"\")","v":""}]
[73,{"$nulls":21},{"$f":"IF(Tabelle_Auswertung[[#This Row],[Bildname]]<>\"\",\n    IF(Tabelle_Auswertung[[#This Row],[abwesend]]=\"ja\",\n        SUM(Tabelle_Auswertung[[#This Row],[Juror 1]:[Juror 20]])/COUNT(Tabelle_Auswertung[[#This Row],[Juror 1]:[Juror 20]])*(COUNT(Tabelle_Auswertung[[#This Row],[Juror 1]:[Juror 20]])-1),\n        SUM(Tabelle_Auswertung[[#This Row],[Juror 1]:[Juror 20]])\n    ),\n\" - \")","v":" - "},{"$f":"IF(Tabelle_Auswertung[[#This Row],[Bildname]]<>\"\",IF(Tabelle_Auswertung[[#This Row],[Punkte]]>0,AVERAGE(Tabelle_Auswertung[[#This Row],[Juror 1]:[Juror 20]]),\" - \"),\" - \")","v":" - "},{"$f":"IF(Tabelle_Auswertung[[#This Row],[Bildname]]<>\"\",IF(Tabelle_Auswertung[[#This Row],[Punkte]]>0,RANK(Tabelle_Auswertung[[#This Row],[Punkte]],[Punkte],0),\" - \"),\" - \")","v":" - "}," - - -",null,{"$f":"IF(Tabelle_Auswertung[[#This Row],[Platz]]=1,CONCATENATE(Tabelle_Auswertung[[#This Row],[Bildname]],\" von \",Tabelle_Auswertung[[#This Row],[Autor(in)]]),\"\")","v":""},{"$f":"IF(Tabelle_Auswertung[[#This Row],[Platz]]=2,CONCATENATE(Tabelle_Auswertung[[#This Row],[Bildname]],\" von \",Tabelle_Auswertung[[#This Row],[Autor(in)]]),\"\")","v":""},{"$f":"IF(Tabelle_Auswertung[[#This Row],[Platz]]=3,CONCATENATE(Tabelle_Auswertung[[#This Row],[Bildname]],\" von \",Tabelle_Auswertung[[#This Row],[Autor(in)]]),\"\")","v":""},{"$f":"IF(Tabelle_Auswertung[[#This Row],[Platz]]=4,CONCATENATE(Tabelle_Auswertung[[#This Row],[Bildname]],\" von \",Tabelle_Auswertung[[#This Row],[Autor(in)]]),\"\")","v":""},{"$f":"IF(Tabelle_Auswertung[[#This Row],[Platz]]=5,CONCATENATE(Tabelle_Auswertung[[#This Row],[Bildname]],\" von \",Tabelle_Auswertung[[#This Row],[Autor(in)]]),\"\")","v":""},{"$f":"IF(Tabelle_Auswertung[[#This Row],[Platz]]=6,CONCATENATE(Tabelle_Auswertung[[#This Row],[Bildname]],\" von \",Tabelle_Auswertung[[#This Row],[Autor(in)]]),\"\")","v":""},{"$f":"IF(Tabelle_Auswertung[[#This Row],[Platz]]=7,CONCATENATE(Tabelle_Auswertung[[#This Row],[Bildname]],\" von \",Tabelle_Auswertung[[#This Row],[Autor(in)]]),\"\")","v":""},{"$f":"IF(Tabelle_Auswertung[[#This Row],[Platz]]=8,CONCATENATE(Tabelle_Auswertung[[#This Row],[Bildname]],\" von \",Tabelle_Auswertung[[#This Row],[Autor(in)]]),\"\")","v":""},{"$f":"IF(Tabelle_Auswertung[[#This Row],[Platz]]=9,CONCATENATE(Tabelle_Auswertung[[#This Row],[Bildname]],\" von \",Tabelle_Auswertung[[#This Row],[Autor(in)]]),\"\")","v":""},{"$f":"IF(Tabelle_Auswertung[[#This Row],[Platz]]=10,CONCATENATE(Tabelle_Auswertung[[#This Row],[Bildname]],\" von \",Tabelle_Auswertung[[#This Row],[Autor(in)]]),\"\")","v":""}]
[74,{"$nulls":21},{"$f":"IF(Tabelle_Auswertung[[#This Row],[Bildname]]<>\"\",\n    IF(Tabelle_Auswertung[[#This Row],[abwesend]]=\"ja\",\n        SUM(Tabelle_Auswertung[[#This Row],[Juror 1]:[Juror 20]])/COUNT(Tabelle_Auswertung[[#This Row],[Juror 1]:[Juror 20]])*(COUNT(Tabelle_Auswertung[[#This Row],[Juror 1]:[Juror 20]])-1),\n        SUM(Tabelle_Auswertung[[#This Row],[Juror 1]:[Juror 20]])\n    ),\n\" - \")","v":" - "},{"$f":"IF(Tabelle_Auswertung[[#This Row],[Bildname]]<>\"\",IF(Tabelle_Auswertung[[#This Row],[Punkte]]>0,AVERAGE(Tabelle_Auswertung[[#This Row],[Juror 1]:[Juror 20]]),\" - \"),\" - \")","v":" - "},{"$f":"IF(Tabelle_Auswertung[[#This Row],[Bildname]]<>\"\",IF(Tabelle_Auswertung[[#This Row],[Punkte]]>0,RANK(Tabelle_Auswertung[[#This Row],[Punkte]],[Punkte],0),\" - \"),\" - \")","v":" - "}," - - -",null,{"$f":"IF(Tabelle_Auswertung[[#This Row],[Platz]]=1,CONCATENATE(Tabelle_Auswertung[[#This Row],[Bildname]],\" von \",Tabelle_Auswertung[[#This Row],[Autor(in)]]),\"\")","v":""},{"$f":"IF(Tabelle_Auswertung[[#This Row],[Platz]]=2,CONCATENATE(Tabelle_Auswertung[[#This Row],[Bildname]],\" von \",Tabelle_Auswertung[[#This Row],[Autor(in)]]),\"\")","v":""},{"$f":"IF(Tabelle_Auswertung[[#This Row],[Platz]]=3,CONCATENATE(Tabelle_Auswertung[[#This Row],[Bildname]],\" von \",Tabelle_Auswertung[[#This Row],[Autor(in)]]),\"\")","v":""},{"$f":"IF(Tabelle_Auswertung[[#This Row],[Platz]]=4,CONCATENATE(Tabelle_Auswertung[[#This Row],[Bildname]],\" von \",Tabelle_Auswertung[[#This Row],[Autor(in)]]),\"\")","v":""},{"$f":"IF(Tabelle_Auswertung[[#This Row],[Platz]]=5,CONCATENATE(Tabelle_Auswertung[[#This Row],[Bildname]],\" von \",Tabelle_Auswertung[[#This Row],[Autor(in)]]),\"\")","v":""},{"$f":"IF(Tabelle_Auswertung[[#This Row],[Platz]]=6,CONCATENATE(Tabelle_Auswertung[[#This Row],[Bildname]],\" von \",Tabelle_Auswertung[[#This Row],[Autor(in)]]),\"\")","v":""},{"$f":"IF(Tabelle_Auswertung[[#This Row],[Platz]]=7,CONCATENATE(Tabelle_Auswertung[[#This Row],[Bildname]],\" von \",Tabelle_Auswertung[[#This Row],[Autor(in)]]),\"\")","v":""},{"$f":"IF(Tabelle_Auswertung[[#This Row],[Platz]]=8,CONCATENATE(Tabelle_Auswertung[[#This Row],[Bildname]],\" von \",Tabelle_Auswertung[[#This Row],[Autor(in)]]),\"\")","v":""},{"$f":"IF(Tabelle_Auswertung[[#This Row],[Platz]]=9,CONCATENATE(Tabelle_Auswertung[[#This Row],[Bildname]],\" von \",Tabelle_Auswertung[[#This Row],[Autor(in)]]),\"\")","v":""},{"$f":"IF(Tabelle_Auswertung[[#This Row],[Platz]]=10,CONCATENATE(Tabelle_Auswertung[[#This Row],[Bildname]],\" von \",Tabelle_Auswertung[[#This Row],[Autor(in)]]),\"\")","v":""}]
[75,{"$nulls":21},{"$f":"IF(Tabelle_Auswertung[[#This Row],[Bildname]]<>\"\",\n    IF(Tabelle_Auswertung[[#This Row],[abwesend]]=\"ja\",\n        SUM(Tabelle_Auswertung[[#This Row],[Juror 1]:[Juror 20]])/COUNT(Tabelle_Auswertung[[#This Row],[Juror 1]:[Juror 20]])*(COUNT(Tabelle_Auswertung[[#This Row],[Juror 1]:[Juror 20]])-1),\n        SUM(Tabelle_Auswertung[[#This Row],[Juror 1]:[Juror 20]])\n    ),\n\" - \")","v":" - "},{"$f":"IF(Tabelle_Auswertung[[#This Row],[Bildname]]<>\"\",IF(Tabelle_Auswertung[[#This Row],[Punkte]]>0,AVERAGE(Tabelle_Auswertung[[#This Row],[Juror 1]:[Juror 20]]),\" - \"),\" - \")","v":" - "},{"$f":"IF(Tabelle_Auswertung[[#This Row],[Bildname]]<>\"\",IF(Tabelle_Auswertung[[#This Row],[Punkte]]>0,RANK(Tabelle_Auswertung[[#This Row],[Punkte]],[Punkte],0),\" - \"),\" - \")","v":" - "}," - - -",null,{"$f":"IF(Tabelle_Auswertung[[#This Row],[Platz]]=1,CONCATENATE(Tabelle_Auswertung[[#This Row],[Bildname]],\" von \",Tabelle_Auswertung[[#This Row],[Autor(in)]]),\"\")","v":""},{"$f":"IF(Tabelle_Auswertung[[#This Row],[Platz]]=2,CONCATENATE(Tabelle_Auswertung[[#This Row],[Bildname]],\" von \",Tabelle_Auswertung[[#This Row],[Autor(in)]]),\"\")","v":""},{"$f":"IF(Tabelle_Auswertung[[#This Row],[Platz]]=3,CONCATENATE(Tabelle_Auswertung[[#This Row],[Bildname]],\" von \",Tabelle_Auswertung[[#This Row],[Autor(in)]]),\"\")","v":""},{"$f":"IF(Tabelle_Auswertung[[#This Row],[Platz]]=4,CONCATENATE(Tabelle_Auswertung[[#This Row],[Bildname]],\" von \",Tabelle_Auswertung[[#This Row],[Autor(in)]]),\"\")","v":""},{"$f":"IF(Tabelle_Auswertung[[#This Row],[Platz]]=5,CONCATENATE(Tabelle_Auswertung[[#This Row],[Bildname]],\" von \",Tabelle_Auswertung[[#This Row],[Autor(in)]]),\"\")","v":""},{"$f":"IF(Tabelle_Auswertung[[#This Row],[Platz]]=6,CONCATENATE(Tabelle_Auswertung[[#This Row],[Bildname]],\" von \",Tabelle_Auswertung[[#This Row],[Autor(in)]]),\"\")","v":""},{"$f":"IF(Tabelle_Auswertung[[#This Row],[Platz]]=7,CONCATENATE(Tabelle_Auswertung[[#This Row],[Bildname]],\" von \",Tabelle_Auswertung[[#This Row],[Autor(in)]]),\"\")","v":""},{"$f":"IF(Tabelle_Auswertung[[#This Row],[Platz]]=8,CONCATENATE(Tabelle_Auswertung[[#This Row],[Bildname]],\" von \",Tabelle_Auswertung[[#This Row],[Autor(in)]]),\"\")","v":""},{"$f":"IF(Tabelle_Auswertung[[#This Row],[Platz]]=9,CONCATENATE(Tabelle_Auswertung[[#This Row],[Bildname]],\" von \",Tabelle_Auswertung[[#This Row],[Autor(in)]]),\"\")","v":""},{"$f":"IF(Tabelle_Auswertung[[#This Row],[Platz]]=10,CONCATENATE(Tabelle_Auswertung[[#This Row],[Bildname]],\" von \",Tabelle_Auswertung[[#This Row],[Autor(in)]]),\"\")","v":""}]
[76,{"$nulls":21},{"$f":"IF(Tabelle_Auswertung[[#This Row],[Bildname]]<>\"\",\n    IF(Tabelle_Auswertung[[#This Row],[abwesend]]=\"ja\",\n        SUM(Tabelle_Auswertung[[#This Row],[Juror 1]:[Juror 20]])/COUNT(Tabelle_Auswertung[[#This Row],[Juror 1]:[Juror 20]])*(COUNT(Tabelle_Auswertung[[#This Row],[Juror 1]:[Juror 20]])-1),\n        SUM(Tabelle_Auswertung[[#This Row],[Juror 1]:[Juror 20]])\n    ),\n\" - \")","v":" - "},{"$f":"IF(Tabelle_Auswertung[[#This Row],[Bildname]]<>\"\",IF(Tabelle_Auswertung[[#This Row],[Punkte]]>0,AVERAGE(Tabelle_Auswertung[[#This Row],[Juror 1]:[Juror 20]]),\" - \"),\" - \")","v":" - "},{"$f":"IF(Tabelle_Auswertung[[#This Row],[Bildname]]<>\"\",IF(Tabelle_Auswertung[[#This Row],[Punkte]]>0,RANK(Tabelle_Auswertung[[#This Row],[Punkte]],[Punkte],0),\" - \"),\" - \")","v":" - "}," - - -",null,{"$f":"IF(Tabelle_Auswertung[[#This Row],[Platz]]=1,CONCATENATE(Tabelle_Auswertung[[#This Row],[Bildname]],\" von \",Tabelle_Auswertung[[#This Row],[Autor(in)]]),\"\")","v":""},{"$f":"IF(Tabelle_Auswertung[[#This Row],[Platz]]=2,CONCATENATE(Tabelle_Auswertung[[#This Row],[Bildname]],\" von \",Tabelle_Auswertung[[#This Row],[Autor(in)]]),\"\")","v":""},{"$f":"IF(Tabelle_Auswertung[[#This Row],[Platz]]=3,CONCATENATE(Tabelle_Auswertung[[#This Row],[Bildname]],\" von \",Tabelle_Auswertung[[#This Row],[Autor(in)]]),\"\")","v":""},{"$f":"IF(Tabelle_Auswertung[[#This Row],[Platz]]=4,CONCATENATE(Tabelle_Auswertung[[#This Row],[Bildname]],\" von \",Tabelle_Auswertung[[#This Row],[Autor(in)]]),\"\")","v":""},{"$f":"IF(Tabelle_Auswertung[[#This Row],[Platz]]=5,CONCATENATE(Tabelle_Auswertung[[#This Row],[Bildname]],\" von \",Tabelle_Auswertung[[#This Row],[Autor(in)]]),\"\")","v":""},{"$f":"IF(Tabelle_Auswertung[[#This Row],[Platz]]=6,CONCATENATE(Tabelle_Auswertung[[#This Row],[Bildname]],\" von \",Tabelle_Auswertung[[#This Row],[Autor(in)]]),\"\")","v":""},{"$f":"IF(Tabelle_Auswertung[[#This Row],[Platz]]=7,CONCATENATE(Tabelle_Auswertung[[#This Row],[Bildname]],\" von \",Tabelle_Auswertung[[#This Row],[Autor(in)]]),\"\")","v":""},{"$f":"IF(Tabelle_Auswertung[[#This Row],[Platz]]=8,CONCATENATE(Tabelle_Auswertung[[#This Row],[Bildname]],\" von \",Tabelle_Auswertung[[#This Row],[Autor(in)]]),\"\")","v":""},{"$f":"IF(Tabelle_Auswertung[[#This Row],[Platz]]=9,CONCATENATE(Tabelle_Auswertung[[#This Row],[Bildname]],\" von \",Tabelle_Auswertung[[#This Row],[Autor(in)]]),\"\")","v":""},{"$f":"IF(Tabelle_Auswertung[[#This Row],[Platz]]=10,CONCATENATE(Tabelle_Auswertung[[#This Row],[Bildname]],\" von \",Tabelle_Auswertung[[#This Row],[Autor(in)]]),\"\")","v":""}]
[77,{"$nulls":21},{"$f":"IF(Tabelle_Auswertung[[#This Row],[Bildname]]<>\"\",\n    IF(Tabelle_Auswertung[[#This Row],[abwesend]]=\"ja\",\n        SUM(Tabelle_Auswertung[[#This Row],[Juror 1]:[Juror 20]])/COUNT(Tabelle_Auswertung[[#This Row],[Juror 1]:[Juror 20]])*(COUNT(Tabelle_Auswertung[[#This Row],[Juror 1]:[Juror 20]])-1),\n        SUM(Tabelle_Auswertung[[#This Row],[Juror 1]:[Juror 20]])\n    ),\n\" - \")","v":" - "},{"$f":"IF(Tabelle_Auswertung[[#This Row],[Bildname]]<>\"\",IF(Tabelle_Auswertung[[#This Row],[Punkte]]>0,AVERAGE(Tabelle_Auswertung[[#This Row],[Juror 1]:[Juror 20]]),\" - \"),\" - \")","v":" - "},{"$f":"IF(Tabelle_Auswertung[[#This Row],[Bildname]]<>\"\",IF(Tabelle_Auswertung[[#This Row],[Punkte]]>0,RANK(Tabelle_Auswertung[[#This Row],[Punkte]],[Punkte],0),\" - \"),\" - \")","v":" - "}," - - -",null,{"$f":"IF(Tabelle_Auswertung[[#This Row],[Platz]]=1,CONCATENATE(Tabelle_Auswertung[[#This Row],[Bildname]],\" von \",Tabelle_Auswertung[[#This Row],[Autor(in)]]),\"\")","v":""},{"$f":"IF(Tabelle_Auswertung[[#This Row],[Platz]]=2,CONCATENATE(Tabelle_Auswertung[[#This Row],[Bildname]],\" von \",Tabelle_Auswertung[[#This Row],[Autor(in)]]),\"\")","v":""},{"$f":"IF(Tabelle_Auswertung[[#This Row],[Platz]]=3,CONCATENATE(Tabelle_Auswertung[[#This Row],[Bildname]],\" von \",Tabelle_Auswertung[[#This Row],[Autor(in)]]),\"\")","v":""},{"$f":"IF(Tabelle_Auswertung[[#This Row],[Platz]]=4,CONCATENATE(Tabelle_Auswertung[[#This Row],[Bildname]],\" von \",Tabelle_Auswertung[[#This Row],[Autor(in)]]),\"\")","v":""},{"$f":"IF(Tabelle_Auswertung[[#This Row],[Platz]]=5,CONCATENATE(Tabelle_Auswertung[[#This Row],[Bildname]],\" von \",Tabelle_Auswertung[[#This Row],[Autor(in)]]),\"\")","v":""},{"$f":"IF(Tabelle_Auswertung[[#This Row],[Platz]]=6,CONCATENATE(Tabelle_Auswertung[[#This Row],[Bildname]],\" von \",Tabelle_Auswertung[[#This Row],[Autor(in)]]),\"\")","v":""},{"$f":"IF(Tabelle_Auswertung[[#This Row],[Platz]]=7,CONCATENATE(Tabelle_Auswertung[[#This Row],[Bildname]],\" von \",Tabelle_Auswertung[[#This Row],[Autor(in)]]),\"\")","v":""},{"$f":"IF(Tabelle_Auswertung[[#This Row],[Platz]]=8,CONCATENATE(Tabelle_Auswertung[[#This Row],[Bildname]],\" von \",Tabelle_Auswertung[[#This Row],[Autor(in)]]),\"\")","v":""},{"$f":"IF(Tabelle_Auswertung[[#This Row],[Platz]]=9,CONCATENATE(Tabelle_Auswertung[[#This Row],[Bildname]],\" von \",Tabelle_Auswertung[[#This Row],[Autor(in)]]),\"\")","v":""},{"$f":"IF(Tabelle_Auswertung[[#This Row],[Platz]]=10,CONCATENATE(Tabelle_Auswertung[[#This Row],[Bildname]],\" von \",Tabelle_Auswertung[[#This Row],[Autor(in)]]),\"\")","v":""}]
[78,{"$nulls":21},{"$f":"IF(Tabelle_Auswertung[[#This Row],[Bildname]]<>\"\",\n    IF(Tabelle_Auswertung[[#This Row],[abwesend]]=\"ja\",\n        SUM(Tabelle_Auswertung[[#This Row],[Juror 1]:[Juror 20]])/COUNT(Tabelle_Auswertung[[#This Row],[Juror 1]:[Juror 20]])*(COUNT(Tabelle_Auswertung[[#This Row],[Juror 1]:[Juror 20]])-1),\n        SUM(Tabelle_Auswertung[[#This Row],[Juror 1]:[Juror 20]])\n    ),\n\" - \")","v":" - "},{"$f":"IF(Tabelle_Auswertung[[#This Row],[Bildname]]<>\"\",IF(Tabelle_Auswertung[[#This Row],[Punkte]]>0,AVERAGE(Tabelle_Auswertung[[#This Row],[Juror 1]:[Juror 20]]),\" - \"),\" - \")","v":" - "},{"$f":"IF(Tabelle_Auswertung[[#This Row],[Bildname]]<>\"\",IF(Tabelle_Auswertung[[#This Row],[Punkte]]>0,RANK(Tabelle_Auswertung[[#This Row],[Punkte]],[Punkte],0),\" - \"),\" - \")","v":" - "}," - - -",null,{"$f":"IF(Tabelle_Auswertung[[#This Row],[Platz]]=1,CONCATENATE(Tabelle_Auswertung[[#This Row],[Bildname]],\" von \",Tabelle_Auswertung[[#This Row],[Autor(in)]]),\"\")","v":""},{"$f":"IF(Tabelle_Auswertung[[#This Row],[Platz]]=2,CONCATENATE(Tabelle_Auswertung[[#This Row],[Bildname]],\" von \",Tabelle_Auswertung[[#This Row],[Autor(in)]]),\"\")","v":""},{"$f":"IF(Tabelle_Auswertung[[#This Row],[Platz]]=3,CONCATENATE(Tabelle_Auswertung[[#This Row],[Bildname]],\" von \",Tabelle_Auswertung[[#This Row],[Autor(in)]]),\"\")","v":""},{"$f":"IF(Tabelle_Auswertung[[#This Row],[Platz]]=4,CONCATENATE(Tabelle_Auswertung[[#This Row],[Bildname]],\" von \",Tabelle_Auswertung[[#This Row],[Autor(in)]]),\"\")","v":""},{"$f":"IF(Tabelle_Auswertung[[#This Row],[Platz]]=5,CONCATENATE(Tabelle_Auswertung[[#This Row],[Bildname]],\" von \",Tabelle_Auswertung[[#This Row],[Autor(in)]]),\"\")","v":""},{"$f":"IF(Tabelle_Auswertung[[#This Row],[Platz]]=6,CONCATENATE(Tabelle_Auswertung[[#This Row],[Bildname]],\" von \",Tabelle_Auswertung[[#This Row],[Autor(in)]]),\"\")","v":""},{"$f":"IF(Tabelle_Auswertung[[#This Row],[Platz]]=7,CONCATENATE(Tabelle_Auswertung[[#This Row],[Bildname]],\" von \",Tabelle_Auswertung[[#This Row],[Autor(in)]]),\"\")","v":""},{"$f":"IF(Tabelle_Auswertung[[#This Row],[Platz]]=8,CONCATENATE(Tabelle_Auswertung[[#This Row],[Bildname]],\" von \",Tabelle_Auswertung[[#This Row],[Autor(in)]]),\"\")","v":""},{"$f":"IF(Tabelle_Auswertung[[#This Row],[Platz]]=9,CONCATENATE(Tabelle_Auswertung[[#This Row],[Bildname]],\" von \",Tabelle_Auswertung[[#This Row],[Autor(in)]]),\"\")","v":""},{"$f":"IF(Tabelle_Auswertung[[#This Row],[Platz]]=10,CONCATENATE(Tabelle_Auswertung[[#This Row],[Bildname]],\" von \",Tabelle_Auswertung[[#This Row],[Autor(in)]]),\"\")","v":""}]
[79,{"$nulls":21},{"$f":"IF(Tabelle_Auswertung[[#This Row],[Bildname]]<>\"\",\n    IF(Tabelle_Auswertung[[#This Row],[abwesend]]=\"ja\",\n        SUM(Tabelle_Auswertung[[#This Row],[Juror 1]:[Juror 20]])/COUNT(Tabelle_Auswertung[[#This Row],[Juror 1]:[Juror 20]])*(COUNT(Tabelle_Auswertung[[#This Row],[Juror 1]:[Juror 20]])-1),\n        SUM(Tabelle_Auswertung[[#This Row],[Juror 1]:[Juror 20]])\n    ),\n\" - \")","v":" - "},{"$f":"IF(Tabelle_Auswertung[[#This Row],[Bildname]]<>\"\",IF(Tabelle_Auswertung[[#This Row],[Punkte]]>0,AVERAGE(Tabelle_Auswertung[[#This Row],[Juror 1]:[Juror 20]]),\" - \"),\" - \")","v":" - "},{"$f":"IF(Tabelle_Auswertung[[#This Row],[Bildname]]<>\"\",IF(Tabelle_Auswertung[[#This Row],[Punkte]]>0,RANK(Tabelle_Auswertung[[#This Row],[Punkte]],[Punkte],0),\" - \"),\" - \")","v":" - "}," - - -",null,{"$f":"IF(Tabelle_Auswertung[[#This Row],[Platz]]=1,CONCATENATE(Tabelle_Auswertung[[#This Row],[Bildname]],\" von \",Tabelle_Auswertung[[#This Row],[Autor(in)]]),\"\")","v":""},{"$f":"IF(Tabelle_Auswertung[[#This Row],[Platz]]=2,CONCATENATE(Tabelle_Auswertung[[#This Row],[Bildname]],\" von \",Tabelle_Auswertung[[#This Row],[Autor(in)]]),\"\")","v":""},{"$f":"IF(Tabelle_Auswertung[[#This Row],[Platz]]=3,CONCATENATE(Tabelle_Auswertung[[#This Row],[Bildname]],\" von \",Tabelle_Auswertung[[#This Row],[Autor(in)]]),\"\")","v":""},{"$f":"IF(Tabelle_Auswertung[[#This Row],[Platz]]=4,CONCATENATE(Tabelle_Auswertung[[#This Row],[Bildname]],\" von \",Tabelle_Auswertung[[#This Row],[Autor(in)]]),\"\")","v":""},{"$f":"IF(Tabelle_Auswertung[[#This Row],[Platz]]=5,CONCATENATE(Tabelle_Auswertung[[#This Row],[Bildname]],\" von \",Tabelle_Auswertung[[#This Row],[Autor(in)]]),\"\")","v":""},{"$f":"IF(Tabelle_Auswertung[[#This Row],[Platz]]=6,CONCATENATE(Tabelle_Auswertung[[#This Row],[Bildname]],\" von \",Tabelle_Auswertung[[#This Row],[Autor(in)]]),\"\")","v":""},{"$f":"IF(Tabelle_Auswertung[[#This Row],[Platz]]=7,CONCATENATE(Tabelle_Auswertung[[#This Row],[Bildname]],\" von \",Tabelle_Auswertung[[#This Row],[Autor(in)]]),\"\")","v":""},{"$f":"IF(Tabelle_Auswertung[[#This Row],[Platz]]=8,CONCATENATE(Tabelle_Auswertung[[#This Row],[Bildname]],\" von \",Tabelle_Auswertung[[#This Row],[Autor(in)]]),\"\")","v":""},{"$f":"IF(Tabelle_Auswertung[[#This Row],[Platz]]=9,CONCATENATE(Tabelle_Auswertung[[#This Row],[Bildname]],\" von \",Tabelle_Auswertung[[#This Row],[Autor(in)]]),\"\")","v":""},{"$f":"IF(Tabelle_Auswertung[[#This Row],[Platz]]=10,CONCATENATE(Tabelle_Auswertung[[#This Row],[Bildname]],\" von \",Tabelle_Auswertung[[#This Row],[Autor(in)]]),\"\")","v":""}]
[80,{"$nulls":21},{"$f":"IF(Tabelle_Auswertung[[#This Row],[Bildname]]<>\"\",\n    IF(Tabelle_Auswertung[[#This Row],[abwesend]]=\"ja\",\n        SUM(Tabelle_Auswertung[[#This Row],[Juror 1]:[Juror 20]])/COUNT(Tabelle_Auswertung[[#This Row],[Juror 1]:[Juror 20]])*(COUNT(Tabelle_Auswertung[[#This Row],[Juror 1]:[Juror 20]])-1),\n        SUM(Tabelle_Auswertung[[#This Row],[Juror 1]:[Juror 20]])\n    ),\n\" - \")","v":" - "},{"$f":"IF(Tabelle_Auswertung[[#This Row],[Bildname]]<>\"\",IF(Tabelle_Auswertung[[#This Row],[Punkte]]>0,AVERAGE(Tabelle_Auswertung[[#This Row],[Juror 1]:[Juror 20]]),\" - \"),\" - \")","v":" - "},{"$f":"IF(Tabelle_Auswertung[[#This Row],[Bildname]]<>\"\",IF(Tabelle_Auswertung[[#This Row],[Punkte]]>0,RANK(Tabelle_Auswertung[[#This Row],[Punkte]],[Punkte],0),\" - \"),\" - \")","v":" - "}," - - -",null,{"$f":"IF(Tabelle_Auswertung[[#This Row],[Platz]]=1,CONCATENATE(Tabelle_Auswertung[[#This Row],[Bildname]],\" von \",Tabelle_Auswertung[[#This Row],[Autor(in)]]),\"\")","v":""},{"$f":"IF(Tabelle_Auswertung[[#This Row],[Platz]]=2,CONCATENATE(Tabelle_Auswertung[[#This Row],[Bildname]],\" von \",Tabelle_Auswertung[[#This Row],[Autor(in)]]),\"\")","v":""},{"$f":"IF(Tabelle_Auswertung[[#This Row],[Platz]]=3,CONCATENATE(Tabelle_Auswertung[[#This Row],[Bildname]],\" von \",Tabelle_Auswertung[[#This Row],[Autor(in)]]),\"\")","v":""},{"$f":"IF(Tabelle_Auswertung[[#This Row],[Platz]]=4,CONCATENATE(Tabelle_Auswertung[[#This Row],[Bildname]],\" von \",Tabelle_Auswertung[[#This Row],[Autor(in)]]),\"\")","v":""},{"$f":"IF(Tabelle_Auswertung[[#This Row],[Platz]]=5,CONCATENATE(Tabelle_Auswertung[[#This Row],[Bildname]],\" von \",Tabelle_Auswertung[[#This Row],[Autor(in)]]),\"\")","v":""},{"$f":"IF(Tabelle_Auswertung[[#This Row],[Platz]]=6,CONCATENATE(Tabelle_Auswertung[[#This Row],[Bildname]],\" von \",Tabelle_Auswertung[[#This Row],[Autor(in)]]),\"\")","v":""},{"$f":"IF(Tabelle_Auswertung[[#This Row],[Platz]]=7,CONCATENATE(Tabelle_Auswertung[[#This Row],[Bildname]],\" von \",Tabelle_Auswertung[[#This Row],[Autor(in)]]),\"\")","v":""},{"$f":"IF(Tabelle_Auswertung[[#This Row],[Platz]]=8,CONCATENATE(Tabelle_Auswertung[[#This Row],[Bildname]],\" von \",Tabelle_Auswertung[[#This Row],[Autor(in)]]),\"\")","v":""},{"$f":"IF(Tabelle_Auswertung[[#This Row],[Platz]]=9,CONCATENATE(Tabelle_Auswertung[[#This Row],[Bildname]],\" von \",Tabelle_Auswertung[[#This Row],[Autor(in)]]),\"\")","v":""},{"$f":"IF(Tabelle_Auswertung[[#This Row],[Platz]]=10,CONCATENATE(Tabelle_Auswertung[[#This Row],[Bildname]],\" von \",Tabelle_Auswertung[[#This Row],[Autor(in)]]),\"\")","v":""}]
[81,{"$nulls":21},{"$f":"IF(Tabelle_Auswertung[[#This Row],[Bildname]]<>\"\",\n    IF(Tabelle_Auswertung[[#This Row],[abwesend]]=\"ja\",\n        SUM(Tabelle_Auswertung[[#This Row],[Juror 1]:[Juror 20]])/COUNT(Tabelle_Auswertung[[#This Row],[Juror 1]:[Juror 20]])*(COUNT(Tabelle_Auswertung[[#This Row],[Juror 1]:[Juror 20]])-1),\n        SUM(Tabelle_Auswertung[[#This Row],[Juror 1]:[Juror 20]])\n    ),\n\" - \")","v":" - "},{"$f":"IF(Tabelle_Auswertung[[#This Row],[Bildname]]<>\"\",IF(Tabelle_Auswertung[[#This Row],[Punkte]]>0,AVERAGE(Tabelle_Auswertung[[#This Row],[Juror 1]:[Juror 20]]),\" - \"),\" - \")","v":" - "},{"$f":"IF(Tabelle_Auswertung[[#This Row],[Bildname]]<>\"\",IF(Tabelle_Auswertung[[#This Row],[Punkte]]>0,RANK(Tabelle_Auswertung[[#This Row],[Punkte]],[Punkte],0),\" - \"),\" - \")","v":" - "}," - - -",null,{"$f":"IF(Tabelle_Auswertung[[#This Row],[Platz]]=1,CONCATENATE(Tabelle_Auswertung[[#This Row],[Bildname]],\" von \",Tabelle_Auswertung[[#This Row],[Autor(in)]]),\"\")","v":""},{"$f":"IF(Tabelle_Auswertung[[#This Row],[Platz]]=2,CONCATENATE(Tabelle_Auswertung[[#This Row],[Bildname]],\" von \",Tabelle_Auswertung[[#This Row],[Autor(in)]]),\"\")","v":""},{"$f":"IF(Tabelle_Auswertung[[#This Row],[Platz]]=3,CONCATENATE(Tabelle_Auswertung[[#This Row],[Bildname]],\" von \",Tabelle_Auswertung[[#This Row],[Autor(in)]]),\"\")","v":""},{"$f":"IF(Tabelle_Auswertung[[#This Row],[Platz]]=4,CONCATENATE(Tabelle_Auswertung[[#This Row],[Bildname]],\" von \",Tabelle_Auswertung[[#This Row],[Autor(in)]]),\"\")","v":""},{"$f":"IF(Tabelle_Auswertung[[#This Row],[Platz]]=5,CONCATENATE(Tabelle_Auswertung[[#This Row],[Bildname]],\" von \",Tabelle_Auswertung[[#This Row],[Autor(in)]]),\"\")","v":""},{"$f":"IF(Tabelle_Auswertung[[#This Row],[Platz]]=6,CONCATENATE(Tabelle_Auswertung[[#This Row],[Bildname]],\" von \",Tabelle_Auswertung[[#This Row],[Autor(in)]]),\"\")","v":""},{"$f":"IF(Tabelle_Auswertung[[#This Row],[Platz]]=7,CONCATENATE(Tabelle_Auswertung[[#This Row],[Bildname]],\" von \",Tabelle_Auswertung[[#This Row],[Autor(in)]]),\"\")","v":""},{"$f":"IF(Tabelle_Auswertung[[#This Row],[Platz]]=8,CONCATENATE(Tabelle_Auswertung[[#This Row],[Bildname]],\" von \",Tabelle_Auswertung[[#This Row],[Autor(in)]]),\"\")","v":""},{"$f":"IF(Tabelle_Auswertung[[#This Row],[Platz]]=9,CONCATENATE(Tabelle_Auswertung[[#This Row],[Bildname]],\" von \",Tabelle_Auswertung[[#This Row],[Autor(in)]]),\"\")","v":""},{"$f":"IF(Tabelle_Auswertung[[#This Row],[Platz]]=10,CONCATENATE(Tabelle_Auswertung[[#This Row],[Bildname]],\" von \",Tabelle_Auswertung[[#This Row],[Autor(in)]]),\"\")","v":""}]
[82,{"$nulls":21},{"$f":"IF(Tabelle_Auswertung[[#This Row],[Bildname]]<>\"\",\n    IF(Tabelle_Auswertung[[#This Row],[abwesend]]=\"ja\",\n        SUM(Tabelle_Auswertung[[#This Row],[Juror 1]:[Juror 20]])/COUNT(Tabelle_Auswertung[[#This Row],[Juror 1]:[Juror 20]])*(COUNT(Tabelle_Auswertung[[#This Row],[Juror 1]:[Juror 20]])-1),\n        SUM(Tabelle_Auswertung[[#This Row],[Juror 1]:[Juror 20]])\n    ),\n\" - \")","v":" - "},{"$f":"IF(Tabelle_Auswertung[[#This Row],[Bildname]]<>\"\",IF(Tabelle_Auswertung[[#This Row],[Punkte]]>0,AVERAGE(Tabelle_Auswertung[[#This Row],[Juror 1]:[Juror 20]]),\" - \"),\" - \")","v":" - "},{"$f":"IF(Tabelle_Auswertung[[#This Row],[Bildname]]<>\"\",IF(Tabelle_Auswertung[[#This Row],[Punkte]]>0,RANK(Tabelle_Auswertung[[#This Row],[Punkte]],[Punkte],0),\" - \"),\" - \")","v":" - "}," - - -",null,{"$f":"IF(Tabelle_Auswertung[[#This Row],[Platz]]=1,CONCATENATE(Tabelle_Auswertung[[#This Row],[Bildname]],\" von \",Tabelle_Auswertung[[#This Row],[Autor(in)]]),\"\")","v":""},{"$f":"IF(Tabelle_Auswertung[[#This Row],[Platz]]=2,CONCATENATE(Tabelle_Auswertung[[#This Row],[Bildname]],\" von \",Tabelle_Auswertung[[#This Row],[Autor(in)]]),\"\")","v":""},{"$f":"IF(Tabelle_Auswertung[[#This Row],[Platz]]=3,CONCATENATE(Tabelle_Auswertung[[#This Row],[Bildname]],\" von \",Tabelle_Auswertung[[#This Row],[Autor(in)]]),\"\")","v":""},{"$f":"IF(Tabelle_Auswertung[[#This Row],[Platz]]=4,CONCATENATE(Tabelle_Auswertung[[#This Row],[Bildname]],\" von \",Tabelle_Auswertung[[#This Row],[Autor(in)]]),\"\")","v":""},{"$f":"IF(Tabelle_Auswertung[[#This Row],[Platz]]=5,CONCATENATE(Tabelle_Auswertung[[#This Row],[Bildname]],\" von \",Tabelle_Auswertung[[#This Row],[Autor(in)]]),\"\")","v":""},{"$f":"IF(Tabelle_Auswertung[[#This Row],[Platz]]=6,CONCATENATE(Tabelle_Auswertung[[#This Row],[Bildname]],\" von \",Tabelle_Auswertung[[#This Row],[Autor(in)]]),\"\")","v":""},{"$f":"IF(Tabelle_Auswertung[[#This Row],[Platz]]=7,CONCATENATE(Tabelle_Auswertung[[#This Row],[Bildname]],\" von \",Tabelle_Auswertung[[#This Row],[Autor(in)]]),\"\")","v":""},{"$f":"IF(Tabelle_Auswertung[[#This Row],[Platz]]=8,CONCATENATE(Tabelle_Auswertung[[#This Row],[Bildname]],\" von \",Tabelle_Auswertung[[#This Row],[Autor(in)]]),\"\")","v":""},{"$f":"IF(Tabelle_Auswertung[[#This Row],[Platz]]=9,CONCATENATE(Tabelle_Auswertung[[#This Row],[Bildname]],\" von \",Tabelle_Auswertung[[#This Row],[Autor(in)]]),\"\")","v":""},{"$f":"IF(Tabelle_Auswertung[[#This Row],[Platz]]=10,CONCATENATE(Tabelle_Auswertung[[#This Row],[Bildname]],\" von \",Tabelle_Auswertung[[#This Row],[Autor(in)]]),\"\")","v":""}]
[83,{"$nulls":21},{"$f":"IF(Tabelle_Auswertung[[#This Row],[Bildname]]<>\"\",\n    IF(Tabelle_Auswertung[[#This Row],[abwesend]]=\"ja\",\n        SUM(Tabelle_Auswertung[[#This Row],[Juror 1]:[Juror 20]])/COUNT(Tabelle_Auswertung[[#This Row],[Juror 1]:[Juror 20]])*(COUNT(Tabelle_Auswertung[[#This Row],[Juror 1]:[Juror 20]])-1),\n        SUM(Tabelle_Auswertung[[#This Row],[Juror 1]:[Juror 20]])\n    ),\n\" - \")","v":" - "},{"$f":"IF(Tabelle_Auswertung[[#This Row],[Bildname]]<>\"\",IF(Tabelle_Auswertung[[#This Row],[Punkte]]>0,AVERAGE(Tabelle_Auswertung[[#This Row],[Juror 1]:[Juror 20]]),\" - \"),\" - \")","v":" - "},{"$f":"IF(Tabelle_Auswertung[[#This Row],[Bildname]]<>\"\",IF(Tabelle_Auswertung[[#This Row],[Punkte]]>0,RANK(Tabelle_Auswertung[[#This Row],[Punkte]],[Punkte],0),\" - \"),\" - \")","v":" - "}," - - -",null,{"$f":"IF(Tabelle_Auswertung[[#This Row],[Platz]]=1,CONCATENATE(Tabelle_Auswertung[[#This Row],[Bildname]],\" von \",Tabelle_Auswertung[[#This Row],[Autor(in)]]),\"\")","v":""},{"$f":"IF(Tabelle_Auswertung[[#This Row],[Platz]]=2,CONCATENATE(Tabelle_Auswertung[[#This Row],[Bildname]],\" von \",Tabelle_Auswertung[[#This Row],[Autor(in)]]),\"\")","v":""},{"$f":"IF(Tabelle_Auswertung[[#This Row],[Platz]]=3,CONCATENATE(Tabelle_Auswertung[[#This Row],[Bildname]],\" von \",Tabelle_Auswertung[[#This Row],[Autor(in)]]),\"\")","v":""},{"$f":"IF(Tabelle_Auswertung[[#This Row],[Platz]]=4,CONCATENATE(Tabelle_Auswertung[[#This Row],[Bildname]],\" von \",Tabelle_Auswertung[[#This Row],[Autor(in)]]),\"\")","v":""},{"$f":"IF(Tabelle_Auswertung[[#This Row],[Platz]]=5,CONCATENATE(Tabelle_Auswertung[[#This Row],[Bildname]],\" von \",Tabelle_Auswertung[[#This Row],[Autor(in)]]),\"\")","v":""},{"$f":"IF(Tabelle_Auswertung[[#This Row],[Platz]]=6,CONCATENATE(Tabelle_Auswertung[[#This Row],[Bildname]],\" von \",Tabelle_Auswertung[[#This Row],[Autor(in)]]),\"\")","v":""},{"$f":"IF(Tabelle_Auswertung[[#This Row],[Platz]]=7,CONCATENATE(Tabelle_Auswertung[[#This Row],[Bildname]],\" von \",Tabelle_Auswertung[[#This Row],[Autor(in)]]),\"\")","v":""},{"$f":"IF(Tabelle_Auswertung[[#This Row],[Platz]]=8,CONCATENATE(Tabelle_Auswertung[[#This Row],[Bildname]],\" von \",Tabelle_Auswertung[[#This Row],[Autor(in)]]),\"\")","v":""},{"$f":"IF(Tabelle_Auswertung[[#This Row],[Platz]]=9,CONCATENATE(Tabelle_Auswertung[[#This Row],[Bildname]],\" von \",Tabelle_Auswertung[[#This Row],[Autor(in)]]),\"\")","v":""},{"$f":"IF(Tabelle_Auswertung[[#This Row],[Platz]]=10,CONCATENATE(Tabelle_Auswertung[[#This Row],[Bildname]],\" von \",Tabelle_Auswertung[[#This Row],[Autor(in)]]),\"\")","v":""}]
[84,{"$nulls":21},{"$f":"IF(Tabelle_Auswertung[[#This Row],[Bildname]]<>\"\",\n    IF(Tabelle_Auswertung[[#This Row],[abwesend]]=\"ja\",\n        SUM(Tabelle_Auswertung[[#This Row],[Juror 1]:[Juror 20]])/COUNT(Tabelle_Auswertung[[#This Row],[Juror 1]:[Juror 20]])*(COUNT(Tabelle_Auswertung[[#This Row],[Juror 1]:[Juror 20]])-1),\n        SUM(Tabelle_Auswertung[[#This Row],[Juror 1]:[Juror 20]])\n    ),\n\" - \")","v":" - "},{"$f":"IF(Tabelle_Auswertung[[#This Row],[Bildname]]<>\"\",IF(Tabelle_Auswertung[[#This Row],[Punkte]]>0,AVERAGE(Tabelle_Auswertung[[#This Row],[Juror 1]:[Juror 20]]),\" - \"),\" - \")","v":" - "},{"$f":"IF(Tabelle_Auswertung[[#This Row],[Bildname]]<>\"\",IF(Tabelle_Auswertung[[#This Row],[Punkte]]>0,RANK(Tabelle_Auswertung[[#This Row],[Punkte]],[Punkte],0),\" - \"),\" - \")","v":" - "}," - - -",null,{"$f":"IF(Tabelle_Auswertung[[#This Row],[Platz]]=1,CONCATENATE(Tabelle_Auswertung[[#This Row],[Bildname]],\" von \",Tabelle_Auswertung[[#This Row],[Autor(in)]]),\"\")","v":""},{"$f":"IF(Tabelle_Auswertung[[#This Row],[Platz]]=2,CONCATENATE(Tabelle_Auswertung[[#This Row],[Bildname]],\" von \",Tabelle_Auswertung[[#This Row],[Autor(in)]]),\"\")","v":""},{"$f":"IF(Tabelle_Auswertung[[#This Row],[Platz]]=3,CONCATENATE(Tabelle_Auswertung[[#This Row],[Bildname]],\" von \",Tabelle_Auswertung[[#This Row],[Autor(in)]]),\"\")","v":""},{"$f":"IF(Tabelle_Auswertung[[#This Row],[Platz]]=4,CONCATENATE(Tabelle_Auswertung[[#This Row],[Bildname]],\" von \",Tabelle_Auswertung[[#This Row],[Autor(in)]]),\"\")","v":""},{"$f":"IF(Tabelle_Auswertung[[#This Row],[Platz]]=5,CONCATENATE(Tabelle_Auswertung[[#This Row],[Bildname]],\" von \",Tabelle_Auswertung[[#This Row],[Autor(in)]]),\"\")","v":""},{"$f":"IF(Tabelle_Auswertung[[#This Row],[Platz]]=6,CONCATENATE(Tabelle_Auswertung[[#This Row],[Bildname]],\" von \",Tabelle_Auswertung[[#This Row],[Autor(in)]]),\"\")","v":""},{"$f":"IF(Tabelle_Auswertung[[#This Row],[Platz]]=7,CONCATENATE(Tabelle_Auswertung[[#This Row],[Bildname]],\" von \",Tabelle_Auswertung[[#This Row],[Autor(in)]]),\"\")","v":""},{"$f":"IF(Tabelle_Auswertung[[#This Row],[Platz]]=8,CONCATENATE(Tabelle_Auswertung[[#This Row],[Bildname]],\" von \",Tabelle_Auswertung[[#This Row],[Autor(in)]]),\"\")","v":""},{"$f":"IF(Tabelle_Auswertung[[#This Row],[Platz]]=9,CONCATENATE(Tabelle_Auswertung[[#This Row],[Bildname]],\" von \",Tabelle_Auswertung[[#This Row],[Autor(in)]]),\"\")","v":""},{"$f":"IF(Tabelle_Auswertung[[#This Row],[Platz]]=10,CONCATENATE(Tabelle_Auswertung[[#This Row],[Bildname]],\" von \",Tabelle_Auswertung[[#This Row],[Autor(in)]]),\"\")","v":""}]
[85,{"$nulls":21},{"$f":"IF(Tabelle_Auswertung[[#This Row],[Bildname]]<>\"\",\n    IF(Tabelle_Auswertung[[#This Row],[abwesend]]=\"ja\",\n        SUM(Tabelle_Auswertung[[#This Row],[Juror 1]:[Juror 20]])/COUNT(Tabelle_Auswertung[[#This Row],[Juror 1]:[Juror 20]])*(COUNT(Tabelle_Auswertung[[#This Row],[Juror 1]:[Juror 20]])-1),\n        SUM(Tabelle_Auswertung[[#This Row],[Juror 1]:[Juror 20]])\n    ),\n\" - \")","v":" - "},{"$f":"IF(Tabelle_Auswertung[[#This Row],[Bildname]]<>\"\",IF(Tabelle_Auswertung[[#This Row],[Punkte]]>0,AVERAGE(Tabelle_Auswertung[[#This Row],[Juror 1]:[Juror 20]]),\" - \"),\" - \")","v":" - "},{"$f":"IF(Tabelle_Auswertung[[#This Row],[Bildname]]<>\"\",IF(Tabelle_Auswertung[[#This Row],[Punkte]]>0,RANK(Tabelle_Auswertung[[#This Row],[Punkte]],[Punkte],0),\" - \"),\" - \")","v":" - "}," - - -",null,{"$f":"IF(Tabelle_Auswertung[[#This Row],[Platz]]=1,CONCATENATE(Tabelle_Auswertung[[#This Row],[Bildname]],\" von \",Tabelle_Auswertung[[#This Row],[Autor(in)]]),\"\")","v":""},{"$f":"IF(Tabelle_Auswertung[[#This Row],[Platz]]=2,CONCATENATE(Tabelle_Auswertung[[#This Row],[Bildname]],\" von \",Tabelle_Auswertung[[#This Row],[Autor(in)]]),\"\")","v":""},{"$f":"IF(Tabelle_Auswertung[[#This Row],[Platz]]=3,CONCATENATE(Tabelle_Auswertung[[#This Row],[Bildname]],\" von \",Tabelle_Auswertung[[#This Row],[Autor(in)]]),\"\")","v":""},{"$f":"IF(Tabelle_Auswertung[[#This Row],[Platz]]=4,CONCATENATE(Tabelle_Auswertung[[#This Row],[Bildname]],\" von \",Tabelle_Auswertung[[#This Row],[Autor(in)]]),\"\")","v":""},{"$f":"IF(Tabelle_Auswertung[[#This Row],[Platz]]=5,CONCATENATE(Tabelle_Auswertung[[#This Row],[Bildname]],\" von \",Tabelle_Auswertung[[#This Row],[Autor(in)]]),\"\")","v":""},{"$f":"IF(Tabelle_Auswertung[[#This Row],[Platz]]=6,CONCATENATE(Tabelle_Auswertung[[#This Row],[Bildname]],\" von \",Tabelle_Auswertung[[#This Row],[Autor(in)]]),\"\")","v":""},{"$f":"IF(Tabelle_Auswertung[[#This Row],[Platz]]=7,CONCATENATE(Tabelle_Auswertung[[#This Row],[Bildname]],\" von \",Tabelle_Auswertung[[#This Row],[Autor(in)]]),\"\")","v":""},{"$f":"IF(Tabelle_Auswertung[[#This Row],[Platz]]=8,CONCATENATE(Tabelle_Auswertung[[#This Row],[Bildname]],\" von \",Tabelle_Auswertung[[#This Row],[Autor(in)]]),\"\")","v":""},{"$f":"IF(Tabelle_Auswertung[[#This Row],[Platz]]=9,CONCATENATE(Tabelle_Auswertung[[#This Row],[Bildname]],\" von \",Tabelle_Auswertung[[#This Row],[Autor(in)]]),\"\")","v":""},{"$f":"IF(Tabelle_Auswertung[[#This Row],[Platz]]=10,CONCATENATE(Tabelle_Auswertung[[#This Row],[Bildname]],\" von \",Tabelle_Auswertung[[#This Row],[Autor(in)]]),\"\")","v":""}]
[86,{"$nulls":21},{"$f":"IF(Tabelle_Auswertung[[#This Row],[Bildname]]<>\"\",\n    IF(Tabelle_Auswertung[[#This Row],[abwesend]]=\"ja\",\n        SUM(Tabelle_Auswertung[[#This Row],[Juror 1]:[Juror 20]])/COUNT(Tabelle_Auswertung[[#This Row],[Juror 1]:[Juror 20]])*(COUNT(Tabelle_Auswertung[[#This Row],[Juror 1]:[Juror 20]])-1),\n        SUM(Tabelle_Auswertung[[#This Row],[Juror 1]:[Juror 20]])\n    ),\n\" - \")","v":" - "},{"$f":"IF(Tabelle_Auswertung[[#This Row],[Bildname]]<>\"\",IF(Tabelle_Auswertung[[#This Row],[Punkte]]>0,AVERAGE(Tabelle_Auswertung[[#This Row],[Juror 1]:[Juror 20]]),\" - \"),\" - \")","v":" - "},{"$f":"IF(Tabelle_Auswertung[[#This Row],[Bildname]]<>\"\",IF(Tabelle_Auswertung[[#This Row],[Punkte]]>0,RANK(Tabelle_Auswertung[[#This Row],[Punkte]],[Punkte],0),\" - \"),\" - \")","v":" - "}," - - -",null,{"$f":"IF(Tabelle_Auswertung[[#This Row],[Platz]]=1,CONCATENATE(Tabelle_Auswertung[[#This Row],[Bildname]],\" von \",Tabelle_Auswertung[[#This Row],[Autor(in)]]),\"\")","v":""},{"$f":"IF(Tabelle_Auswertung[[#This Row],[Platz]]=2,CONCATENATE(Tabelle_Auswertung[[#This Row],[Bildname]],\" von \",Tabelle_Auswertung[[#This Row],[Autor(in)]]),\"\")","v":""},{"$f":"IF(Tabelle_Auswertung[[#This Row],[Platz]]=3,CONCATENATE(Tabelle_Auswertung[[#This Row],[Bildname]],\" von \",Tabelle_Auswertung[[#This Row],[Autor(in)]]),\"\")","v":""},{"$f":"IF(Tabelle_Auswertung[[#This Row],[Platz]]=4,CONCATENATE(Tabelle_Auswertung[[#This Row],[Bildname]],\" von \",Tabelle_Auswertung[[#This Row],[Autor(in)]]),\"\")","v":""},{"$f":"IF(Tabelle_Auswertung[[#This Row],[Platz]]=5,CONCATENATE(Tabelle_Auswertung[[#This Row],[Bildname]],\" von \",Tabelle_Auswertung[[#This Row],[Autor(in)]]),\"\")","v":""},{"$f":"IF(Tabelle_Auswertung[[#This Row],[Platz]]=6,CONCATENATE(Tabelle_Auswertung[[#This Row],[Bildname]],\" von \",Tabelle_Auswertung[[#This Row],[Autor(in)]]),\"\")","v":""},{"$f":"IF(Tabelle_Auswertung[[#This Row],[Platz]]=7,CONCATENATE(Tabelle_Auswertung[[#This Row],[Bildname]],\" von \",Tabelle_Auswertung[[#This Row],[Autor(in)]]),\"\")","v":""},{"$f":"IF(Tabelle_Auswertung[[#This Row],[Platz]]=8,CONCATENATE(Tabelle_Auswertung[[#This Row],[Bildname]],\" von \",Tabelle_Auswertung[[#This Row],[Autor(in)]]),\"\")","v":""},{"$f":"IF(Tabelle_Auswertung[[#This Row],[Platz]]=9,CONCATENATE(Tabelle_Auswertung[[#This Row],[Bildname]],\" von \",Tabelle_Auswertung[[#This Row],[Autor(in)]]),\"\")","v":""},{"$f":"IF(Tabelle_Auswertung[[#This Row],[Platz]]=10,CONCATENATE(Tabelle_Auswertung[[#This Row],[Bildname]],\" von \",Tabelle_Auswertung[[#This Row],[Autor(in)]]),\"\")","v":""}]
[87,{"$nulls":21},{"$f":"IF(Tabelle_Auswertung[[#This Row],[Bildname]]<>\"\",\n    IF(Tabelle_Auswertung[[#This Row],[abwesend]]=\"ja\",\n        SUM(Tabelle_Auswertung[[#This Row],[Juror 1]:[Juror 20]])/COUNT(Tabelle_Auswertung[[#This Row],[Juror 1]:[Juror 20]])*(COUNT(Tabelle_Auswertung[[#This Row],[Juror 1]:[Juror 20]])-1),\n        SUM(Tabelle_Auswertung[[#This Row],[Juror 1]:[Juror 20]])\n    ),\n\" - \")","v":" - "},{"$f":"IF(Tabelle_Auswertung[[#This Row],[Bildname]]<>\"\",IF(Tabelle_Auswertung[[#This Row],[Punkte]]>0,AVERAGE(Tabelle_Auswertung[[#This Row],[Juror 1]:[Juror 20]]),\" - \"),\" - \")","v":" - "},{"$f":"IF(Tabelle_Auswertung[[#This Row],[Bildname]]<>\"\",IF(Tabelle_Auswertung[[#This Row],[Punkte]]>0,RANK(Tabelle_Auswertung[[#This Row],[Punkte]],[Punkte],0),\" - \"),\" - \")","v":" - "}," - - -",null,{"$f":"IF(Tabelle_Auswertung[[#This Row],[Platz]]=1,CONCATENATE(Tabelle_Auswertung[[#This Row],[Bildname]],\" von \",Tabelle_Auswertung[[#This Row],[Autor(in)]]),\"\")","v":""},{"$f":"IF(Tabelle_Auswertung[[#This Row],[Platz]]=2,CONCATENATE(Tabelle_Auswertung[[#This Row],[Bildname]],\" von \",Tabelle_Auswertung[[#This Row],[Autor(in)]]),\"\")","v":""},{"$f":"IF(Tabelle_Auswertung[[#This Row],[Platz]]=3,CONCATENATE(Tabelle_Auswertung[[#This Row],[Bildname]],\" von \",Tabelle_Auswertung[[#This Row],[Autor(in)]]),\"\")","v":""},{"$f":"IF(Tabelle_Auswertung[[#This Row],[Platz]]=4,CONCATENATE(Tabelle_Auswertung[[#This Row],[Bildname]],\" von \",Tabelle_Auswertung[[#This Row],[Autor(in)]]),\"\")","v":""},{"$f":"IF(Tabelle_Auswertung[[#This Row],[Platz]]=5,CONCATENATE(Tabelle_Auswertung[[#This Row],[Bildname]],\" von \",Tabelle_Auswertung[[#This Row],[Autor(in)]]),\"\")","v":""},{"$f":"IF(Tabelle_Auswertung[[#This Row],[Platz]]=6,CONCATENATE(Tabelle_Auswertung[[#This Row],[Bildname]],\" von \",Tabelle_Auswertung[[#This Row],[Autor(in)]]),\"\")","v":""},{"$f":"IF(Tabelle_Auswertung[[#This Row],[Platz]]=7,CONCATENATE(Tabelle_Auswertung[[#This Row],[Bildname]],\" von \",Tabelle_Auswertung[[#This Row],[Autor(in)]]),\"\")","v":""},{"$f":"IF(Tabelle_Auswertung[[#This Row],[Platz]]=8,CONCATENATE(Tabelle_Auswertung[[#This Row],[Bildname]],\" von \",Tabelle_Auswertung[[#This Row],[Autor(in)]]),\"\")","v":""},{"$f":"IF(Tabelle_Auswertung[[#This Row],[Platz]]=9,CONCATENATE(Tabelle_Auswertung[[#This Row],[Bildname]],\" von \",Tabelle_Auswertung[[#This Row],[Autor(in)]]),\"\")","v":""},{"$f":"IF(Tabelle_Auswertung[[#This Row],[Platz]]=10,CONCATENATE(Tabelle_Auswertung[[#This Row],[Bildname]],\" von \",Tabelle_Auswertung[[#This Row],[Autor(in)]]),\"\")","v":""}]
[88,{"$nulls":21},{"$f":"IF(Tabelle_Auswertung[[#This Row],[Bildname]]<>\"\",\n    IF(Tabelle_Auswertung[[#This Row],[abwesend]]=\"ja\",\n        SUM(Tabelle_Auswertung[[#This Row],[Juror 1]:[Juror 20]])/COUNT(Tabelle_Auswertung[[#This Row],[Juror 1]:[Juror 20]])*(COUNT(Tabelle_Auswertung[[#This Row],[Juror 1]:[Juror 20]])-1),\n        SUM(Tabelle_Auswertung[[#This Row],[Juror 1]:[Juror 20]])\n    ),\n\" - \")","v":" - "},{"$f":"IF(Tabelle_Auswertung[[#This Row],[Bildname]]<>\"\",IF(Tabelle_Auswertung[[#This Row],[Punkte]]>0,AVERAGE(Tabelle_Auswertung[[#This Row],[Juror 1]:[Juror 20]]),\" - \"),\" - \")","v":" - "},{"$f":"IF(Tabelle_Auswertung[[#This Row],[Bildname]]<>\"\",IF(Tabelle_Auswertung[[#This Row],[Punkte]]>0,RANK(Tabelle_Auswertung[[#This Row],[Punkte]],[Punkte],0),\" - \"),\" - \")","v":" - "}," - - -",null,{"$f":"IF(Tabelle_Auswertung[[#This Row],[Platz]]=1,CONCATENATE(Tabelle_Auswertung[[#This Row],[Bildname]],\" von \",Tabelle_Auswertung[[#This Row],[Autor(in)]]),\"\")","v":""},{"$f":"IF(Tabelle_Auswertung[[#This Row],[Platz]]=2,CONCATENATE(Tabelle_Auswertung[[#This Row],[Bildname]],\" von \",Tabelle_Auswertung[[#This Row],[Autor(in)]]),\"\")","v":""},{"$f":"IF(Tabelle_Auswertung[[#This Row],[Platz]]=3,CONCATENATE(Tabelle_Auswertung[[#This Row],[Bildname]],\" von \",Tabelle_Auswertung[[#This Row],[Autor(in)]]),\"\")","v":""},{"$f":"IF(Tabelle_Auswertung[[#This Row],[Platz]]=4,CONCATENATE(Tabelle_Auswertung[[#This Row],[Bildname]],\" von \",Tabelle_Auswertung[[#This Row],[Autor(in)]]),\"\")","v":""},{"$f":"IF(Tabelle_Auswertung[[#This Row],[Platz]]=5,CONCATENATE(Tabelle_Auswertung[[#This Row],[Bildname]],\" von \",Tabelle_Auswertung[[#This Row],[Autor(in)]]),\"\")","v":""},{"$f":"IF(Tabelle_Auswertung[[#This Row],[Platz]]=6,CONCATENATE(Tabelle_Auswertung[[#This Row],[Bildname]],\" von \",Tabelle_Auswertung[[#This Row],[Autor(in)]]),\"\")","v":""},{"$f":"IF(Tabelle_Auswertung[[#This Row],[Platz]]=7,CONCATENATE(Tabelle_Auswertung[[#This Row],[Bildname]],\" von \",Tabelle_Auswertung[[#This Row],[Autor(in)]]),\"\")","v":""},{"$f":"IF(Tabelle_Auswertung[[#This Row],[Platz]]=8,CONCATENATE(Tabelle_Auswertung[[#This Row],[Bildname]],\" von \",Tabelle_Auswertung[[#This Row],[Autor(in)]]),\"\")","v":""},{"$f":"IF(Tabelle_Auswertung[[#This Row],[Platz]]=9,CONCATENATE(Tabelle_Auswertung[[#This Row],[Bildname]],\" von \",Tabelle_Auswertung[[#This Row],[Autor(in)]]),\"\")","v":""},{"$f":"IF(Tabelle_Auswertung[[#This Row],[Platz]]=10,CONCATENATE(Tabelle_Auswertung[[#This Row],[Bildname]],\" von \",Tabelle_Auswertung[[#This Row],[Autor(in)]]),\"\")","v":""}]
[89,{"$nulls":21},{"$f":"IF(Tabelle_Auswertung[[#This Row],[Bildname]]<>\"\",\n    IF(Tabelle_Auswertung[[#This Row],[abwesend]]=\"ja\",\n        SUM(Tabelle_Auswertung[[#This Row],[Juror 1]:[Juror 20]])/COUNT(Tabelle_Auswertung[[#This Row],[Juror 1]:[Juror 20]])*(COUNT(Tabelle_Auswertung[[#This Row],[Juror 1]:[Juror 20]])-1),\n        SUM(Tabelle_Auswertung[[#This Row],[Juror 1]:[Juror 20]])\n    ),\n\" - \")","v":" - "},{"$f":"IF(Tabelle_Auswertung[[#This Row],[Bildname]]<>\"\",IF(Tabelle_Auswertung[[#This Row],[Punkte]]>0,AVERAGE(Tabelle_Auswertung[[#This Row],[Juror 1]:[Juror 20]]),\" - \"),\" - \")","v":" - "},{"$f":"IF(Tabelle_Auswertung[[#This Row],[Bildname]]<>\"\",IF(Tabelle_Auswertung[[#This Row],[Punkte]]>0,RANK(Tabelle_Auswertung[[#This Row],[Punkte]],[Punkte],0),\" - \"),\" - \")","v":" - "}," - - -",null,{"$f":"IF(Tabelle_Auswertung[[#This Row],[Platz]]=1,CONCATENATE(Tabelle_Auswertung[[#This Row],[Bildname]],\" von \",Tabelle_Auswertung[[#This Row],[Autor(in)]]),\"\")","v":""},{"$f":"IF(Tabelle_Auswertung[[#This Row],[Platz]]=2,CONCATENATE(Tabelle_Auswertung[[#This Row],[Bildname]],\" von \",Tabelle_Auswertung[[#This Row],[Autor(in)]]),\"\")","v":""},{"$f":"IF(Tabelle_Auswertung[[#This Row],[Platz]]=3,CONCATENATE(Tabelle_Auswertung[[#This Row],[Bildname]],\" von \",Tabelle_Auswertung[[#This Row],[Autor(in)]]),\"\")","v":""},{"$f":"IF(Tabelle_Auswertung[[#This Row],[Platz]]=4,CONCATENATE(Tabelle_Auswertung[[#This Row],[Bildname]],\" von \",Tabelle_Auswertung[[#This Row],[Autor(in)]]),\"\")","v":""},{"$f":"IF(Tabelle_Auswertung[[#This Row],[Platz]]=5,CONCATENATE(Tabelle_Auswertung[[#This Row],[Bildname]],\" von \",Tabelle_Auswertung[[#This Row],[Autor(in)]]),\"\")","v":""},{"$f":"IF(Tabelle_Auswertung[[#This Row],[Platz]]=6,CONCATENATE(Tabelle_Auswertung[[#This Row],[Bildname]],\" von \",Tabelle_Auswertung[[#This Row],[Autor(in)]]),\"\")","v":""},{"$f":"IF(Tabelle_Auswertung[[#This Row],[Platz]]=7,CONCATENATE(Tabelle_Auswertung[[#This Row],[Bildname]],\" von \",Tabelle_Auswertung[[#This Row],[Autor(in)]]),\"\")","v":""},{"$f":"IF(Tabelle_Auswertung[[#This Row],[Platz]]=8,CONCATENATE(Tabelle_Auswertung[[#This Row],[Bildname]],\" von \",Tabelle_Auswertung[[#This Row],[Autor(in)]]),\"\")","v":""},{"$f":"IF(Tabelle_Auswertung[[#This Row],[Platz]]=9,CONCATENATE(Tabelle_Auswertung[[#This Row],[Bildname]],\" von \",Tabelle_Auswertung[[#This Row],[Autor(in)]]),\"\")","v":""},{"$f":"IF(Tabelle_Auswertung[[#This Row],[Platz]]=10,CONCATENATE(Tabelle_Auswertung[[#This Row],[Bildname]],\" von \",Tabelle_Auswertung[[#This Row],[Autor(in)]]),\"\")","v":""}]
[90,{"$nulls":21},{"$f":"IF(Tabelle_Auswertung[[#This Row],[Bildname]]<>\"\",\n    IF(Tabelle_Auswertung[[#This Row],[abwesend]]=\"ja\",\n        SUM(Tabelle_Auswertung[[#This Row],[Juror 1]:[Juror 20]])/COUNT(Tabelle_Auswertung[[#This Row],[Juror 1]:[Juror 20]])*(COUNT(Tabelle_Auswertung[[#This Row],[Juror 1]:[Juror 20]])-1),\n        SUM(Tabelle_Auswertung[[#This Row],[Juror 1]:[Juror 20]])\n    ),\n\" - \")","v":" - "},{"$f":"IF(Tabelle_Auswertung[[#This Row],[Bildname]]<>\"\",IF(Tabelle_Auswertung[[#This Row],[Punkte]]>0,AVERAGE(Tabelle_Auswertung[[#This Row],[Juror 1]:[Juror 20]]),\" - \"),\" - \")","v":" - "},{"$f":"IF(Tabelle_Auswertung[[#This Row],[Bildname]]<>\"\",IF(Tabelle_Auswertung[[#This Row],[Punkte]]>0,RANK(Tabelle_Auswertung[[#This Row],[Punkte]],[Punkte],0),\" - \"),\" - \")","v":" - "}," - - -",null,{"$f":"IF(Tabelle_Auswertung[[#This Row],[Platz]]=1,CONCATENATE(Tabelle_Auswertung[[#This Row],[Bildname]],\" von \",Tabelle_Auswertung[[#This Row],[Autor(in)]]),\"\")","v":""},{"$f":"IF(Tabelle_Auswertung[[#This Row],[Platz]]=2,CONCATENATE(Tabelle_Auswertung[[#This Row],[Bildname]],\" von \",Tabelle_Auswertung[[#This Row],[Autor(in)]]),\"\")","v":""},{"$f":"IF(Tabelle_Auswertung[[#This Row],[Platz]]=3,CONCATENATE(Tabelle_Auswertung[[#This Row],[Bildname]],\" von \",Tabelle_Auswertung[[#This Row],[Autor(in)]]),\"\")","v":""},{"$f":"IF(Tabelle_Auswertung[[#This Row],[Platz]]=4,CONCATENATE(Tabelle_Auswertung[[#This Row],[Bildname]],\" von \",Tabelle_Auswertung[[#This Row],[Autor(in)]]),\"\")","v":""},{"$f":"IF(Tabelle_Auswertung[[#This Row],[Platz]]=5,CONCATENATE(Tabelle_Auswertung[[#This Row],[Bildname]],\" von \",Tabelle_Auswertung[[#This Row],[Autor(in)]]),\"\")","v":""},{"$f":"IF(Tabelle_Auswertung[[#This Row],[Platz]]=6,CONCATENATE(Tabelle_Auswertung[[#This Row],[Bildname]],\" von \",Tabelle_Auswertung[[#This Row],[Autor(in)]]),\"\")","v":""},{"$f":"IF(Tabelle_Auswertung[[#This Row],[Platz]]=7,CONCATENATE(Tabelle_Auswertung[[#This Row],[Bildname]],\" von \",Tabelle_Auswertung[[#This Row],[Autor(in)]]),\"\")","v":""},{"$f":"IF(Tabelle_Auswertung[[#This Row],[Platz]]=8,CONCATENATE(Tabelle_Auswertung[[#This Row],[Bildname]],\" von \",Tabelle_Auswertung[[#This Row],[Autor(in)]]),\"\")","v":""},{"$f":"IF(Tabelle_Auswertung[[#This Row],[Platz]]=9,CONCATENATE(Tabelle_Auswertung[[#This Row],[Bildname]],\" von \",Tabelle_Auswertung[[#This Row],[Autor(in)]]),\"\")","v":""},{"$f":"IF(Tabelle_Auswertung[[#This Row],[Platz]]=10,CONCATENATE(Tabelle_Auswertung[[#This Row],[Bildname]],\" von \",Tabelle_Auswertung[[#This Row],[Autor(in)]]),\"\")","v":""}]
[91,{"$nulls":21},{"$f":"IF(Tabelle_Auswertung[[#This Row],[Bildname]]<>\"\",\n    IF(Tabelle_Auswertung[[#This Row],[abwesend]]=\"ja\",\n        SUM(Tabelle_Auswertung[[#This Row],[Juror 1]:[Juror 20]])/COUNT(Tabelle_Auswertung[[#This Row],[Juror 1]:[Juror 20]])*(COUNT(Tabelle_Auswertung[[#This Row],[Juror 1]:[Juror 20]])-1),\n        SUM(Tabelle_Auswertung[[#This Row],[Juror 1]:[Juror 20]])\n    ),\n\" - \")","v":" - "},{"$f":"IF(Tabelle_Auswertung[[#This Row],[Bildname]]<>\"\",IF(Tabelle_Auswertung[[#This Row],[Punkte]]>0,AVERAGE(Tabelle_Auswertung[[#This Row],[Juror 1]:[Juror 20]]),\" - \"),\" - \")","v":" - "},{"$f":"IF(Tabelle_Auswertung[[#This Row],[Bildname]]<>\"\",IF(Tabelle_Auswertung[[#This Row],[Punkte]]>0,RANK(Tabelle_Auswertung[[#This Row],[Punkte]],[Punkte],0),\" - \"),\" - \")","v":" - "}," - - -",null,{"$f":"IF(Tabelle_Auswertung[[#This Row],[Platz]]=1,CONCATENATE(Tabelle_Auswertung[[#This Row],[Bildname]],\" von \",Tabelle_Auswertung[[#This Row],[Autor(in)]]),\"\")","v":""},{"$f":"IF(Tabelle_Auswertung[[#This Row],[Platz]]=2,CONCATENATE(Tabelle_Auswertung[[#This Row],[Bildname]],\" von \",Tabelle_Auswertung[[#This Row],[Autor(in)]]),\"\")","v":""},{"$f":"IF(Tabelle_Auswertung[[#This Row],[Platz]]=3,CONCATENATE(Tabelle_Auswertung[[#This Row],[Bildname]],\" von \",Tabelle_Auswertung[[#This Row],[Autor(in)]]),\"\")","v":""},{"$f":"IF(Tabelle_Auswertung[[#This Row],[Platz]]=4,CONCATENATE(Tabelle_Auswertung[[#This Row],[Bildname]],\" von \",Tabelle_Auswertung[[#This Row],[Autor(in)]]),\"\")","v":""},{"$f":"IF(Tabelle_Auswertung[[#This Row],[Platz]]=5,CONCATENATE(Tabelle_Auswertung[[#This Row],[Bildname]],\" von \",Tabelle_Auswertung[[#This Row],[Autor(in)]]),\"\")","v":""},{"$f":"IF(Tabelle_Auswertung[[#This Row],[Platz]]=6,CONCATENATE(Tabelle_Auswertung[[#This Row],[Bildname]],\" von \",Tabelle_Auswertung[[#This Row],[Autor(in)]]),\"\")","v":""},{"$f":"IF(Tabelle_Auswertung[[#This Row],[Platz]]=7,CONCATENATE(Tabelle_Auswertung[[#This Row],[Bildname]],\" von \",Tabelle_Auswertung[[#This Row],[Autor(in)]]),\"\")","v":""},{"$f":"IF(Tabelle_Auswertung[[#This Row],[Platz]]=8,CONCATENATE(Tabelle_Auswertung[[#This Row],[Bildname]],\" von \",Tabelle_Auswertung[[#This Row],[Autor(in)]]),\"\")","v":""},{"$f":"IF(Tabelle_Auswertung[[#This Row],[Platz]]=9,CONCATENATE(Tabelle_Auswertung[[#This Row],[Bildname]],\" von \",Tabelle_Auswertung[[#This Row],[Autor(in)]]),\"\")","v":""},{"$f":"IF(Tabelle_Auswertung[[#This Row],[Platz]]=10,CONCATENATE(Tabelle_Auswertung[[#This Row],[Bildname]],\" von \",Tabelle_Auswertung[[#This Row],[Autor(in)]]),\"\")","v":""}]
[92,{"$nulls":21},{"$f":"IF(Tabelle_Auswertung[[#This Row],[Bildname]]<>\"\",\n    IF(Tabelle_Auswertung[[#This Row],[abwesend]]=\"ja\",\n        SUM(Tabelle_Auswertung[[#This Row],[Juror 1]:[Juror 20]])/COUNT(Tabelle_Auswertung[[#This Row],[Juror 1]:[Juror 20]])*(COUNT(Tabelle_Auswertung[[#This Row],[Juror 1]:[Juror 20]])-1),\n        SUM(Tabelle_Auswertung[[#This Row],[Juror 1]:[Juror 20]])\n    ),\n\" - \")","v":" - "},{"$f":"IF(Tabelle_Auswertung[[#This Row],[Bildname]]<>\"\",IF(Tabelle_Auswertung[[#This Row],[Punkte]]>0,AVERAGE(Tabelle_Auswertung[[#This Row],[Juror 1]:[Juror 20]]),\" - \"),\" - \")","v":" - "},{"$f":"IF(Tabelle_Auswertung[[#This Row],[Bildname]]<>\"\",IF(Tabelle_Auswertung[[#This Row],[Punkte]]>0,RANK(Tabelle_Auswertung[[#This Row],[Punkte]],[Punkte],0),\" - \"),\" - \")","v":" - "}," - - -",null,{"$f":"IF(Tabelle_Auswertung[[#This Row],[Platz]]=1,CONCATENATE(Tabelle_Auswertung[[#This Row],[Bildname]],\" von \",Tabelle_Auswertung[[#This Row],[Autor(in)]]),\"\")","v":""},{"$f":"IF(Tabelle_Auswertung[[#This Row],[Platz]]=2,CONCATENATE(Tabelle_Auswertung[[#This Row],[Bildname]],\" von \",Tabelle_Auswertung[[#This Row],[Autor(in)]]),\"\")","v":""},{"$f":"IF(Tabelle_Auswertung[[#This Row],[Platz]]=3,CONCATENATE(Tabelle_Auswertung[[#This Row],[Bildname]],\" von \",Tabelle_Auswertung[[#This Row],[Autor(in)]]),\"\")","v":""},{"$f":"IF(Tabelle_Auswertung[[#This Row],[Platz]]=4,CONCATENATE(Tabelle_Auswertung[[#This Row],[Bildname]],\" von \",Tabelle_Auswertung[[#This Row],[Autor(in)]]),\"\")","v":""},{"$f":"IF(Tabelle_Auswertung[[#This Row],[Platz]]=5,CONCATENATE(Tabelle_Auswertung[[#This Row],[Bildname]],\" von \",Tabelle_Auswertung[[#This Row],[Autor(in)]]),\"\")","v":""},{"$f":"IF(Tabelle_Auswertung[[#This Row],[Platz]]=6,CONCATENATE(Tabelle_Auswertung[[#This Row],[Bildname]],\" von \",Tabelle_Auswertung[[#This Row],[Autor(in)]]),\"\")","v":""},{"$f":"IF(Tabelle_Auswertung[[#This Row],[Platz]]=7,CONCATENATE(Tabelle_Auswertung[[#This Row],[Bildname]],\" von \",Tabelle_Auswertung[[#This Row],[Autor(in)]]),\"\")","v":""},{"$f":"IF(Tabelle_Auswertung[[#This Row],[Platz]]=8,CONCATENATE(Tabelle_Auswertung[[#This Row],[Bildname]],\" von \",Tabelle_Auswertung[[#This Row],[Autor(in)]]),\"\")","v":""},{"$f":"IF(Tabelle_Auswertung[[#This Row],[Platz]]=9,CONCATENATE(Tabelle_Auswertung[[#This Row],[Bildname]],\" von \",Tabelle_Auswertung[[#This Row],[Autor(in)]]),\"\")","v":""},{"$f":"IF(Tabelle_Auswertung[[#This Row],[Platz]]=10,CONCATENATE(Tabelle_Auswertung[[#This Row],[Bildname]],\" von \",Tabelle_Auswertung[[#This Row],[Autor(in)]]),\"\")","v":""}]
[93,{"$nulls":21},{"$f":"IF(Tabelle_Auswertung[[#This Row],[Bildname]]<>\"\",\n    IF(Tabelle_Auswertung[[#This Row],[abwesend]]=\"ja\",\n        SUM(Tabelle_Auswertung[[#This Row],[Juror 1]:[Juror 20]])/COUNT(Tabelle_Auswertung[[#This Row],[Juror 1]:[Juror 20]])*(COUNT(Tabelle_Auswertung[[#This Row],[Juror 1]:[Juror 20]])-1),\n        SUM(Tabelle_Auswertung[[#This Row],[Juror 1]:[Juror 20]])\n    ),\n\" - \")","v":" - "},{"$f":"IF(Tabelle_Auswertung[[#This Row],[Bildname]]<>\"\",IF(Tabelle_Auswertung[[#This Row],[Punkte]]>0,AVERAGE(Tabelle_Auswertung[[#This Row],[Juror 1]:[Juror 20]]),\" - \"),\" - \")","v":" - "},{"$f":"IF(Tabelle_Auswertung[[#This Row],[Bildname]]<>\"\",IF(Tabelle_Auswertung[[#This Row],[Punkte]]>0,RANK(Tabelle_Auswertung[[#This Row],[Punkte]],[Punkte],0),\" - \"),\" - \")","v":" - "}," - - -",null,{"$f":"IF(Tabelle_Auswertung[[#This Row],[Platz]]=1,CONCATENATE(Tabelle_Auswertung[[#This Row],[Bildname]],\" von \",Tabelle_Auswertung[[#This Row],[Autor(in)]]),\"\")","v":""},{"$f":"IF(Tabelle_Auswertung[[#This Row],[Platz]]=2,CONCATENATE(Tabelle_Auswertung[[#This Row],[Bildname]],\" von \",Tabelle_Auswertung[[#This Row],[Autor(in)]]),\"\")","v":""},{"$f":"IF(Tabelle_Auswertung[[#This Row],[Platz]]=3,CONCATENATE(Tabelle_Auswertung[[#This Row],[Bildname]],\" von \",Tabelle_Auswertung[[#This Row],[Autor(in)]]),\"\")","v":""},{"$f":"IF(Tabelle_Auswertung[[#This Row],[Platz]]=4,CONCATENATE(Tabelle_Auswertung[[#This Row],[Bildname]],\" von \",Tabelle_Auswertung[[#This Row],[Autor(in)]]),\"\")","v":""},{"$f":"IF(Tabelle_Auswertung[[#This Row],[Platz]]=5,CONCATENATE(Tabelle_Auswertung[[#This Row],[Bildname]],\" von \",Tabelle_Auswertung[[#This Row],[Autor(in)]]),\"\")","v":""},{"$f":"IF(Tabelle_Auswertung[[#This Row],[Platz]]=6,CONCATENATE(Tabelle_Auswertung[[#This Row],[Bildname]],\" von \",Tabelle_Auswertung[[#This Row],[Autor(in)]]),\"\")","v":""},{"$f":"IF(Tabelle_Auswertung[[#This Row],[Platz]]=7,CONCATENATE(Tabelle_Auswertung[[#This Row],[Bildname]],\" von \",Tabelle_Auswertung[[#This Row],[Autor(in)]]),\"\")","v":""},{"$f":"IF(Tabelle_Auswertung[[#This Row],[Platz]]=8,CONCATENATE(Tabelle_Auswertung[[#This Row],[Bildname]],\" von \",Tabelle_Auswertung[[#This Row],[Autor(in)]]),\"\")","v":""},{"$f":"IF(Tabelle_Auswertung[[#This Row],[Platz]]=9,CONCATENATE(Tabelle_Auswertung[[#This Row],[Bildname]],\" von \",Tabelle_Auswertung[[#This Row],[Autor(in)]]),\"\")","v":""},{"$f":"IF(Tabelle_Auswertung[[#This Row],[Platz]]=10,CONCATENATE(Tabelle_Auswertung[[#This Row],[Bildname]],\" von \",Tabelle_Auswertung[[#This Row],[Autor(in)]]),\"\")","v":""}]
[94,{"$nulls":21},{"$f":"IF(Tabelle_Auswertung[[#This Row],[Bildname]]<>\"\",\n    IF(Tabelle_Auswertung[[#This Row],[abwesend]]=\"ja\",\n        SUM(Tabelle_Auswertung[[#This Row],[Juror 1]:[Juror 20]])/COUNT(Tabelle_Auswertung[[#This Row],[Juror 1]:[Juror 20]])*(COUNT(Tabelle_Auswertung[[#This Row],[Juror 1]:[Juror 20]])-1),\n        SUM(Tabelle_Auswertung[[#This Row],[Juror 1]:[Juror 20]])\n    ),\n\" - \")","v":" - "},{"$f":"IF(Tabelle_Auswertung[[#This Row],[Bildname]]<>\"\",IF(Tabelle_Auswertung[[#This Row],[Punkte]]>0,AVERAGE(Tabelle_Auswertung[[#This Row],[Juror 1]:[Juror 20]]),\" - \"),\" - \")","v":" - "},{"$f":"IF(Tabelle_Auswertung[[#This Row],[Bildname]]<>\"\",IF(Tabelle_Auswertung[[#This Row],[Punkte]]>0,RANK(Tabelle_Auswertung[[#This Row],[Punkte]],[Punkte],0),\" - \"),\" - \")","v":" - "}," - - -",null,{"$f":"IF(Tabelle_Auswertung[[#This Row],[Platz]]=1,CONCATENATE(Tabelle_Auswertung[[#This Row],[Bildname]],\" von \",Tabelle_Auswertung[[#This Row],[Autor(in)]]),\"\")","v":""},{"$f":"IF(Tabelle_Auswertung[[#This Row],[Platz]]=2,CONCATENATE(Tabelle_Auswertung[[#This Row],[Bildname]],\" von \",Tabelle_Auswertung[[#This Row],[Autor(in)]]),\"\")","v":""},{"$f":"IF(Tabelle_Auswertung[[#This Row],[Platz]]=3,CONCATENATE(Tabelle_Auswertung[[#This Row],[Bildname]],\" von \",Tabelle_Auswertung[[#This Row],[Autor(in)]]),\"\")","v":""},{"$f":"IF(Tabelle_Auswertung[[#This Row],[Platz]]=4,CONCATENATE(Tabelle_Auswertung[[#This Row],[Bildname]],\" von \",Tabelle_Auswertung[[#This Row],[Autor(in)]]),\"\")","v":""},{"$f":"IF(Tabelle_Auswertung[[#This Row],[Platz]]=5,CONCATENATE(Tabelle_Auswertung[[#This Row],[Bildname]],\" von \",Tabelle_Auswertung[[#This Row],[Autor(in)]]),\"\")","v":""},{"$f":"IF(Tabelle_Auswertung[[#This Row],[Platz]]=6,CONCATENATE(Tabelle_Auswertung[[#This Row],[Bildname]],\" von \",Tabelle_Auswertung[[#This Row],[Autor(in)]]),\"\")","v":""},{"$f":"IF(Tabelle_Auswertung[[#This Row],[Platz]]=7,CONCATENATE(Tabelle_Auswertung[[#This Row],[Bildname]],\" von \",Tabelle_Auswertung[[#This Row],[Autor(in)]]),\"\")","v":""},{"$f":"IF(Tabelle_Auswertung[[#This Row],[Platz]]=8,CONCATENATE(Tabelle_Auswertung[[#This Row],[Bildname]],\" von \",Tabelle_Auswertung[[#This Row],[Autor(in)]]),\"\")","v":""},{"$f":"IF(Tabelle_Auswertung[[#This Row],[Platz]]=9,CONCATENATE(Tabelle_Auswertung[[#This Row],[Bildname]],\" von \",Tabelle_Auswertung[[#This Row],[Autor(in)]]),\"\")","v":""},{"$f":"IF(Tabelle_Auswertung[[#This Row],[Platz]]=10,CONCATENATE(Tabelle_Auswertung[[#This Row],[Bildname]],\" von \",Tabelle_Auswertung[[#This Row],[Autor(in)]]),\"\")","v":""}]
[95,{"$nulls":21},{"$f":"IF(Tabelle_Auswertung[[#This Row],[Bildname]]<>\"\",\n    IF(Tabelle_Auswertung[[#This Row],[abwesend]]=\"ja\",\n        SUM(Tabelle_Auswertung[[#This Row],[Juror 1]:[Juror 20]])/COUNT(Tabelle_Auswertung[[#This Row],[Juror 1]:[Juror 20]])*(COUNT(Tabelle_Auswertung[[#This Row],[Juror 1]:[Juror 20]])-1),\n        SUM(Tabelle_Auswertung[[#This Row],[Juror 1]:[Juror 20]])\n    ),\n\" - \")","v":" - "},{"$f":"IF(Tabelle_Auswertung[[#This Row],[Bildname]]<>\"\",IF(Tabelle_Auswertung[[#This Row],[Punkte]]>0,AVERAGE(Tabelle_Auswertung[[#This Row],[Juror 1]:[Juror 20]]),\" - \"),\" - \")","v":" - "},{"$f":"IF(Tabelle_Auswertung[[#This Row],[Bildname]]<>\"\",IF(Tabelle_Auswertung[[#This Row],[Punkte]]>0,RANK(Tabelle_Auswertung[[#This Row],[Punkte]],[Punkte],0),\" - \"),\" - \")","v":" - "}," - - -",null,{"$f":"IF(Tabelle_Auswertung[[#This Row],[Platz]]=1,CONCATENATE(Tabelle_Auswertung[[#This Row],[Bildname]],\" von \",Tabelle_Auswertung[[#This Row],[Autor(in)]]),\"\")","v":""},{"$f":"IF(Tabelle_Auswertung[[#This Row],[Platz]]=2,CONCATENATE(Tabelle_Auswertung[[#This Row],[Bildname]],\" von \",Tabelle_Auswertung[[#This Row],[Autor(in)]]),\"\")","v":""},{"$f":"IF(Tabelle_Auswertung[[#This Row],[Platz]]=3,CONCATENATE(Tabelle_Auswertung[[#This Row],[Bildname]],\" von \",Tabelle_Auswertung[[#This Row],[Autor(in)]]),\"\")","v":""},{"$f":"IF(Tabelle_Auswertung[[#This Row],[Platz]]=4,CONCATENATE(Tabelle_Auswertung[[#This Row],[Bildname]],\" von \",Tabelle_Auswertung[[#This Row],[Autor(in)]]),\"\")","v":""},{"$f":"IF(Tabelle_Auswertung[[#This Row],[Platz]]=5,CONCATENATE(Tabelle_Auswertung[[#This Row],[Bildname]],\" von \",Tabelle_Auswertung[[#This Row],[Autor(in)]]),\"\")","v":""},{"$f":"IF(Tabelle_Auswertung[[#This Row],[Platz]]=6,CONCATENATE(Tabelle_Auswertung[[#This Row],[Bildname]],\" von \",Tabelle_Auswertung[[#This Row],[Autor(in)]]),\"\")","v":""},{"$f":"IF(Tabelle_Auswertung[[#This Row],[Platz]]=7,CONCATENATE(Tabelle_Auswertung[[#This Row],[Bildname]],\" von \",Tabelle_Auswertung[[#This Row],[Autor(in)]]),\"\")","v":""},{"$f":"IF(Tabelle_Auswertung[[#This Row],[Platz]]=8,CONCATENATE(Tabelle_Auswertung[[#This Row],[Bildname]],\" von \",Tabelle_Auswertung[[#This Row],[Autor(in)]]),\"\")","v":""},{"$f":"IF(Tabelle_Auswertung[[#This Row],[Platz]]=9,CONCATENATE(Tabelle_Auswertung[[#This Row],[Bildname]],\" von \",Tabelle_Auswertung[[#This Row],[Autor(in)]]),\"\")","v":""},{"$f":"IF(Tabelle_Auswertung[[#This Row],[Platz]]=10,CONCATENATE(Tabelle_Auswertung[[#This Row],[Bildname]],\" von \",Tabelle_Auswertung[[#This Row],[Autor(in)]]),\"\")","v":""}]
[96,{"$nulls":21},{"$f":"IF(Tabelle_Auswertung[[#This Row],[Bildname]]<>\"\",\n    IF(Tabelle_Auswertung[[#This Row],[abwesend]]=\"ja\",\n        SUM(Tabelle_Auswertung[[#This Row],[Juror 1]:[Juror 20]])/COUNT(Tabelle_Auswertung[[#This Row],[Juror 1]:[Juror 20]])*(COUNT(Tabelle_Auswertung[[#This Row],[Juror 1]:[Juror 20]])-1),\n        SUM(Tabelle_Auswertung[[#This Row],[Juror 1]:[Juror 20]])\n    ),\n\" - \")","v":" - "},{"$f":"IF(Tabelle_Auswertung[[#This Row],[Bildname]]<>\"\",IF(Tabelle_Auswertung[[#This Row],[Punkte]]>0,AVERAGE(Tabelle_Auswertung[[#This Row],[Juror 1]:[Juror 20]]),\" - \"),\" - \")","v":" - "},{"$f":"IF(Tabelle_Auswertung[[#This Row],[Bildname]]<>\"\",IF(Tabelle_Auswertung[[#This Row],[Punkte]]>0,RANK(Tabelle_Auswertung[[#This Row],[Punkte]],[Punkte],0),\" - \"),\" - \")","v":" - "}," - - -",null,{"$f":"IF(Tabelle_Auswertung[[#This Row],[Platz]]=1,CONCATENATE(Tabelle_Auswertung[[#This Row],[Bildname]],\" von \",Tabelle_Auswertung[[#This Row],[Autor(in)]]),\"\")","v":""},{"$f":"IF(Tabelle_Auswertung[[#This Row],[Platz]]=2,CONCATENATE(Tabelle_Auswertung[[#This Row],[Bildname]],\" von \",Tabelle_Auswertung[[#This Row],[Autor(in)]]),\"\")","v":""},{"$f":"IF(Tabelle_Auswertung[[#This Row],[Platz]]=3,CONCATENATE(Tabelle_Auswertung[[#This Row],[Bildname]],\" von \",Tabelle_Auswertung[[#This Row],[Autor(in)]]),\"\")","v":""},{"$f":"IF(Tabelle_Auswertung[[#This Row],[Platz]]=4,CONCATENATE(Tabelle_Auswertung[[#This Row],[Bildname]],\" von \",Tabelle_Auswertung[[#This Row],[Autor(in)]]),\"\")","v":""},{"$f":"IF(Tabelle_Auswertung[[#This Row],[Platz]]=5,CONCATENATE(Tabelle_Auswertung[[#This Row],[Bildname]],\" von \",Tabelle_Auswertung[[#This Row],[Autor(in)]]),\"\")","v":""},{"$f":"IF(Tabelle_Auswertung[[#This Row],[Platz]]=6,CONCATENATE(Tabelle_Auswertung[[#This Row],[Bildname]],\" von \",Tabelle_Auswertung[[#This Row],[Autor(in)]]),\"\")","v":""},{"$f":"IF(Tabelle_Auswertung[[#This Row],[Platz]]=7,CONCATENATE(Tabelle_Auswertung[[#This Row],[Bildname]],\" von \",Tabelle_Auswertung[[#This Row],[Autor(in)]]),\"\")","v":""},{"$f":"IF(Tabelle_Auswertung[[#This Row],[Platz]]=8,CONCATENATE(Tabelle_Auswertung[[#This Row],[Bildname]],\" von \",Tabelle_Auswertung[[#This Row],[Autor(in)]]),\"\")","v":""},{"$f":"IF(Tabelle_Auswertung[[#This Row],[Platz]]=9,CONCATENATE(Tabelle_Auswertung[[#This Row],[Bildname]],\" von \",Tabelle_Auswertung[[#This Row],[Autor(in)]]),\"\")","v":""},{"$f":"IF(Tabelle_Auswertung[[#This Row],[Platz]]=10,CONCATENATE(Tabelle_Auswertung[[#This Row],[Bildname]],\" von \",Tabelle_Auswertung[[#This Row],[Autor(in)]]),\"\")","v":""}]
[97,{"$nulls":21},{"$f":"IF(Tabelle_Auswertung[[#This Row],[Bildname]]<>\"\",\n    IF(Tabelle_Auswertung[[#This Row],[abwesend]]=\"ja\",\n        SUM(Tabelle_Auswertung[[#This Row],[Juror 1]:[Juror 20]])/COUNT(Tabelle_Auswertung[[#This Row],[Juror 1]:[Juror 20]])*(COUNT(Tabelle_Auswertung[[#This Row],[Juror 1]:[Juror 20]])-1),\n        SUM(Tabelle_Auswertung[[#This Row],[Juror 1]:[Juror 20]])\n    ),\n\" - \")","v":" - "},{"$f":"IF(Tabelle_Auswertung[[#This Row],[Bildname]]<>\"\",IF(Tabelle_Auswertung[[#This Row],[Punkte]]>0,AVERAGE(Tabelle_Auswertung[[#This Row],[Juror 1]:[Juror 20]]),\" - \"),\" - \")","v":" - "},{"$f":"IF(Tabelle_Auswertung[[#This Row],[Bildname]]<>\"\",IF(Tabelle_Auswertung[[#This Row],[Punkte]]>0,RANK(Tabelle_Auswertung[[#This Row],[Punkte]],[Punkte],0),\" - \"),\" - \")","v":" - "}," - - -",null,{"$f":"IF(Tabelle_Auswertung[[#This Row],[Platz]]=1,CONCATENATE(Tabelle_Auswertung[[#This Row],[Bildname]],\" von \",Tabelle_Auswertung[[#This Row],[Autor(in)]]),\"\")","v":""},{"$f":"IF(Tabelle_Auswertung[[#This Row],[Platz]]=2,CONCATENATE(Tabelle_Auswertung[[#This Row],[Bildname]],\" von \",Tabelle_Auswertung[[#This Row],[Autor(in)]]),\"\")","v":""},{"$f":"IF(Tabelle_Auswertung[[#This Row],[Platz]]=3,CONCATENATE(Tabelle_Auswertung[[#This Row],[Bildname]],\" von \",Tabelle_Auswertung[[#This Row],[Autor(in)]]),\"\")","v":""},{"$f":"IF(Tabelle_Auswertung[[#This Row],[Platz]]=4,CONCATENATE(Tabelle_Auswertung[[#This Row],[Bildname]],\" von \",Tabelle_Auswertung[[#This Row],[Autor(in)]]),\"\")","v":""},{"$f":"IF(Tabelle_Auswertung[[#This Row],[Platz]]=5,CONCATENATE(Tabelle_Auswertung[[#This Row],[Bildname]],\" von \",Tabelle_Auswertung[[#This Row],[Autor(in)]]),\"\")","v":""},{"$f":"IF(Tabelle_Auswertung[[#This Row],[Platz]]=6,CONCATENATE(Tabelle_Auswertung[[#This Row],[Bildname]],\" von \",Tabelle_Auswertung[[#This Row],[Autor(in)]]),\"\")","v":""},{"$f":"IF(Tabelle_Auswertung[[#This Row],[Platz]]=7,CONCATENATE(Tabelle_Auswertung[[#This Row],[Bildname]],\" von \",Tabelle_Auswertung[[#This Row],[Autor(in)]]),\"\")","v":""},{"$f":"IF(Tabelle_Auswertung[[#This Row],[Platz]]=8,CONCATENATE(Tabelle_Auswertung[[#This Row],[Bildname]],\" von \",Tabelle_Auswertung[[#This Row],[Autor(in)]]),\"\")","v":""},{"$f":"IF(Tabelle_Auswertung[[#This Row],[Platz]]=9,CONCATENATE(Tabelle_Auswertung[[#This Row],[Bildname]],\" von \",Tabelle_Auswertung[[#This Row],[Autor(in)]]),\"\")","v":""},{"$f":"IF(Tabelle_Auswertung[[#This Row],[Platz]]=10,CONCATENATE(Tabelle_Auswertung[[#This Row],[Bildname]],\" von \",Tabelle_Auswertung[[#This Row],[Autor(in)]]),\"\")","v":""}]
[98,{"$nulls":21},{"$f":"IF(Tabelle_Auswertung[[#This Row],[Bildname]]<>\"\",\n    IF(Tabelle_Auswertung[[#This Row],[abwesend]]=\"ja\",\n        SUM(Tabelle_Auswertung[[#This Row],[Juror 1]:[Juror 20]])/COUNT(Tabelle_Auswertung[[#This Row],[Juror 1]:[Juror 20]])*(COUNT(Tabelle_Auswertung[[#This Row],[Juror 1]:[Juror 20]])-1),\n        SUM(Tabelle_Auswertung[[#This Row],[Juror 1]:[Juror 20]])\n    ),\n\" - \")","v":" - "},{"$f":"IF(Tabelle_Auswertung[[#This Row],[Bildname]]<>\"\",IF(Tabelle_Auswertung[[#This Row],[Punkte]]>0,AVERAGE(Tabelle_Auswertung[[#This Row],[Juror 1]:[Juror 20]]),\" - \"),\" - \")","v":" - "},{"$f":"IF(Tabelle_Auswertung[[#This Row],[Bildname]]<>\"\",IF(Tabelle_Auswertung[[#This Row],[Punkte]]>0,RANK(Tabelle_Auswertung[[#This Row],[Punkte]],[Punkte],0),\" - \"),\" - \")","v":" - "}," - - -",null,{"$f":"IF(Tabelle_Auswertung[[#This Row],[Platz]]=1,CONCATENATE(Tabelle_Auswertung[[#This Row],[Bildname]],\" von \",Tabelle_Auswertung[[#This Row],[Autor(in)]]),\"\")","v":""},{"$f":"IF(Tabelle_Auswertung[[#This Row],[Platz]]=2,CONCATENATE(Tabelle_Auswertung[[#This Row],[Bildname]],\" von \",Tabelle_Auswertung[[#This Row],[Autor(in)]]),\"\")","v":""},{"$f":"IF(Tabelle_Auswertung[[#This Row],[Platz]]=3,CONCATENATE(Tabelle_Auswertung[[#This Row],[Bildname]],\" von \",Tabelle_Auswertung[[#This Row],[Autor(in)]]),\"\")","v":""},{"$f":"IF(Tabelle_Auswertung[[#This Row],[Platz]]=4,CONCATENATE(Tabelle_Auswertung[[#This Row],[Bildname]],\" von \",Tabelle_Auswertung[[#This Row],[Autor(in)]]),\"\")","v":""},{"$f":"IF(Tabelle_Auswertung[[#This Row],[Platz]]=5,CONCATENATE(Tabelle_Auswertung[[#This Row],[Bildname]],\" von \",Tabelle_Auswertung[[#This Row],[Autor(in)]]),\"\")","v":""},{"$f":"IF(Tabelle_Auswertung[[#This Row],[Platz]]=6,CONCATENATE(Tabelle_Auswertung[[#This Row],[Bildname]],\" von \",Tabelle_Auswertung[[#This Row],[Autor(in)]]),\"\")","v":""},{"$f":"IF(Tabelle_Auswertung[[#This Row],[Platz]]=7,CONCATENATE(Tabelle_Auswertung[[#This Row],[Bildname]],\" von \",Tabelle_Auswertung[[#This Row],[Autor(in)]]),\"\")","v":""},{"$f":"IF(Tabelle_Auswertung[[#This Row],[Platz]]=8,CONCATENATE(Tabelle_Auswertung[[#This Row],[Bildname]],\" von \",Tabelle_Auswertung[[#This Row],[Autor(in)]]),\"\")","v":""},{"$f":"IF(Tabelle_Auswertung[[#This Row],[Platz]]=9,CONCATENATE(Tabelle_Auswertung[[#This Row],[Bildname]],\" von \",Tabelle_Auswertung[[#This Row],[Autor(in)]]),\"\")","v":""},{"$f":"IF(Tabelle_Auswertung[[#This Row],[Platz]]=10,CONCATENATE(Tabelle_Auswertung[[#This Row],[Bildname]],\" von \",Tabelle_Auswertung[[#This Row],[Autor(in)]]),\"\")","v":""}]
[99,{"$nulls":21},{"$f":"IF(Tabelle_Auswertung[[#This Row],[Bildname]]<>\"\",\n    IF(Tabelle_Auswertung[[#This Row],[abwesend]]=\"ja\",\n        SUM(Tabelle_Auswertung[[#This Row],[Juror 1]:[Juror 20]])/COUNT(Tabelle_Auswertung[[#This Row],[Juror 1]:[Juror 20]])*(COUNT(Tabelle_Auswertung[[#This Row],[Juror 1]:[Juror 20]])-1),\n        SUM(Tabelle_Auswertung[[#This Row],[Juror 1]:[Juror 20]])\n    ),\n\" - \")","v":" - "},{"$f":"IF(Tabelle_Auswertung[[#This Row],[Bildname]]<>\"\",IF(Tabelle_Auswertung[[#This Row],[Punkte]]>0,AVERAGE(Tabelle_Auswertung[[#This Row],[Juror 1]:[Juror 20]]),\" - \"),\" - \")","v":" - "},{"$f":"IF(Tabelle_Auswertung[[#This Row],[Bildname]]<>\"\",IF(Tabelle_Auswertung[[#This Row],[Punkte]]>0,RANK(Tabelle_Auswertung[[#This Row],[Punkte]],[Punkte],0),\" - \"),\" - \")","v":" - "}," - - -",null,{"$f":"IF(Tabelle_Auswertung[[#This Row],[Platz]]=1,CONCATENATE(Tabelle_Auswertung[[#This Row],[Bildname]],\" von \",Tabelle_Auswertung[[#This Row],[Autor(in)]]),\"\")","v":""},{"$f":"IF(Tabelle_Auswertung[[#This Row],[Platz]]=2,CONCATENATE(Tabelle_Auswertung[[#This Row],[Bildname]],\" von \",Tabelle_Auswertung[[#This Row],[Autor(in)]]),\"\")","v":""},{"$f":"IF(Tabelle_Auswertung[[#This Row],[Platz]]=3,CONCATENATE(Tabelle_Auswertung[[#This Row],[Bildname]],\" von \",Tabelle_Auswertung[[#This Row],[Autor(in)]]),\"\")","v":""},{"$f":"IF(Tabelle_Auswertung[[#This Row],[Platz]]=4,CONCATENATE(Tabelle_Auswertung[[#This Row],[Bildname]],\" von \",Tabelle_Auswertung[[#This Row],[Autor(in)]]),\"\")","v":""},{"$f":"IF(Tabelle_Auswertung[[#This Row],[Platz]]=5,CONCATENATE(Tabelle_Auswertung[[#This Row],[Bildname]],\" von \",Tabelle_Auswertung[[#This Row],[Autor(in)]]),\"\")","v":""},{"$f":"IF(Tabelle_Auswertung[[#This Row],[Platz]]=6,CONCATENATE(Tabelle_Auswertung[[#This Row],[Bildname]],\" von \",Tabelle_Auswertung[[#This Row],[Autor(in)]]),\"\")","v":""},{"$f":"IF(Tabelle_Auswertung[[#This Row],[Platz]]=7,CONCATENATE(Tabelle_Auswertung[[#This Row],[Bildname]],\" von \",Tabelle_Auswertung[[#This Row],[Autor(in)]]),\"\")","v":""},{"$f":"IF(Tabelle_Auswertung[[#This Row],[Platz]]=8,CONCATENATE(Tabelle_Auswertung[[#This Row],[Bildname]],\" von \",Tabelle_Auswertung[[#This Row],[Autor(in)]]),\"\")","v":""},{"$f":"IF(Tabelle_Auswertung[[#This Row],[Platz]]=9,CONCATENATE(Tabelle_Auswertung[[#This Row],[Bildname]],\" von \",Tabelle_Auswertung[[#This Row],[Autor(in)]]),\"\")","v":""},{"$f":"IF(Tabelle_Auswertung[[#This Row],[Platz]]=10,CONCATENATE(Tabelle_Auswertung[[#This Row],[Bildname]],\" von \",Tabelle_Auswertung[[#This Row],[Autor(in)]]),\"\")","v":""}]
[100,{"$nulls":21},{"$f":"IF(Tabelle_Auswertung[[#This Row],[Bildname]]<>\"\",\n    IF(Tabelle_Auswertung[[#This Row],[abwesend]]=\"ja\",\n        SUM(Tabelle_Auswertung[[#This Row],[Juror 1]:[Juror 20]])/COUNT(Tabelle_Auswertung[[#This Row],[Juror 1]:[Juror 20]])*(COUNT(Tabelle_Auswertung[[#This Row],[Juror 1]:[Juror 20]])-1),\n        SUM(Tabelle_Auswertung[[#This Row],[Juror 1]:[Juror 20]])\n    ),\n\" - \")","v":" - "},{"$f":"IF(Tabelle_Auswertung[[#This Row],[Bildname]]<>\"\",IF(Tabelle_Auswertung[[#This Row],[Punkte]]>0,AVERAGE(Tabelle_Auswertung[[#This Row],[Juror 1]:[Juror 20]]),\" - \"),\" - \")","v":" - "},{"$f":"IF(Tabelle_Auswertung[[#This Row],[Bildname]]<>\"\",IF(Tabelle_Auswertung[[#This Row],[Punkte]]>0,RANK(Tabelle_Auswertung[[#This Row],[Punkte]],[Punkte],0),\" - \"),\" - \")","v":" - "}," - - -",null,{"$f":"IF(Tabelle_Auswertung[[#This Row],[Platz]]=1,CONCATENATE(Tabelle_Auswertung[[#This Row],[Bildname]],\" von \",Tabelle_Auswertung[[#This Row],[Autor(in)]]),\"\")","v":""},{"$f":"IF(Tabelle_Auswertung[[#This Row],[Platz]]=2,CONCATENATE(Tabelle_Auswertung[[#This Row],[Bildname]],\" von \",Tabelle_Auswertung[[#This Row],[Autor(in)]]),\"\")","v":""},{"$f":"IF(Tabelle_Auswertung[[#This Row],[Platz]]=3,CONCATENATE(Tabelle_Auswertung[[#This Row],[Bildname]],\" von \",Tabelle_Auswertung[[#This Row],[Autor(in)]]),\"\")","v":""},{"$f":"IF(Tabelle_Auswertung[[#This Row],[Platz]]=4,CONCATENATE(Tabelle_Auswertung[[#This Row],[Bildname]],\" von \",Tabelle_Auswertung[[#This Row],[Autor(in)]]),\"\")","v":""},{"$f":"IF(Tabelle_Auswertung[[#This Row],[Platz]]=5,CONCATENATE(Tabelle_Auswertung[[#This Row],[Bildname]],\" von \",Tabelle_Auswertung[[#This Row],[Autor(in)]]),\"\")","v":""},{"$f":"IF(Tabelle_Auswertung[[#This Row],[Platz]]=6,CONCATENATE(Tabelle_Auswertung[[#This Row],[Bildname]],\" von \",Tabelle_Auswertung[[#This Row],[Autor(in)]]),\"\")","v":""},{"$f":"IF(Tabelle_Auswertung[[#This Row],[Platz]]=7,CONCATENATE(Tabelle_Auswertung[[#This Row],[Bildname]],\" von \",Tabelle_Auswertung[[#This Row],[Autor(in)]]),\"\")","v":""},{"$f":"IF(Tabelle_Auswertung[[#This Row],[Platz]]=8,CONCATENATE(Tabelle_Auswertung[[#This Row],[Bildname]],\" von \",Tabelle_Auswertung[[#This Row],[Autor(in)]]),\"\")","v":""},{"$f":"IF(Tabelle_Auswertung[[#This Row],[Platz]]=9,CONCATENATE(Tabelle_Auswertung[[#This Row],[Bildname]],\" von \",Tabelle_Auswertung[[#This Row],[Autor(in)]]),\"\")","v":""},{"$f":"IF(Tabelle_Auswertung[[#This Row],[Platz]]=10,CONCATENATE(Tabelle_Auswertung[[#This Row],[Bildname]],\" von \",Tabelle_Auswertung[[#This Row],[Autor(in)]]),\"\")","v":""}]
[101,{"$nulls":21},{"$f":"IF(Tabelle_Auswertung[[#This Row],[Bildname]]<>\"\",\n    IF(Tabelle_Auswertung[[#This Row],[abwesend]]=\"ja\",\n        SUM(Tabelle_Auswertung[[#This Row],[Juror 1]:[Juror 20]])/COUNT(Tabelle_Auswertung[[#This Row],[Juror 1]:[Juror 20]])*(COUNT(Tabelle_Auswertung[[#This Row],[Juror 1]:[Juror 20]])-1),\n        SUM(Tabelle_Auswertung[[#This Row],[Juror 1]:[Juror 20]])\n    ),\n\" - \")","v":" - "},{"$f":"IF(Tabelle_Auswertung[[#This Row],[Bildname]]<>\"\",IF(Tabelle_Auswertung[[#This Row],[Punkte]]>0,AVERAGE(Tabelle_Auswertung[[#This Row],[Juror 1]:[Juror 20]]),\" - \"),\" - \")","v":" - "},{"$f":"IF(Tabelle_Auswertung[[#This Row],[Bildname]]<>\"\",IF(Tabelle_Auswertung[[#This Row],[Punkte]]>0,RANK(Tabelle_Auswertung[[#This Row],[Punkte]],[Punkte],0),\" - \"),\" - \")","v":" - "}," - - -",null,{"$f":"IF(Tabelle_Auswertung[[#This Row],[Platz]]=1,CONCATENATE(Tabelle_Auswertung[[#This Row],[Bildname]],\" von \",Tabelle_Auswertung[[#This Row],[Autor(in)]]),\"\")","v":""},{"$f":"IF(Tabelle_Auswertung[[#This Row],[Platz]]=2,CONCATENATE(Tabelle_Auswertung[[#This Row],[Bildname]],\" von \",Tabelle_Auswertung[[#This Row],[Autor(in)]]),\"\")","v":""},{"$f":"IF(Tabelle_Auswertung[[#This Row],[Platz]]=3,CONCATENATE(Tabelle_Auswertung[[#This Row],[Bildname]],\" von \",Tabelle_Auswertung[[#This Row],[Autor(in)]]),\"\")","v":""},{"$f":"IF(Tabelle_Auswertung[[#This Row],[Platz]]=4,CONCATENATE(Tabelle_Auswertung[[#This Row],[Bildname]],\" von \",Tabelle_Auswertung[[#This Row],[Autor(in)]]),\"\")","v":""},{"$f":"IF(Tabelle_Auswertung[[#This Row],[Platz]]=5,CONCATENATE(Tabelle_Auswertung[[#This Row],[Bildname]],\" von \",Tabelle_Auswertung[[#This Row],[Autor(in)]]),\"\")","v":""},{"$f":"IF(Tabelle_Auswertung[[#This Row],[Platz]]=6,CONCATENATE(Tabelle_Auswertung[[#This Row],[Bildname]],\" von \",Tabelle_Auswertung[[#This Row],[Autor(in)]]),\"\")","v":""},{"$f":"IF(Tabelle_Auswertung[[#This Row],[Platz]]=7,CONCATENATE(Tabelle_Auswertung[[#This Row],[Bildname]],\" von \",Tabelle_Auswertung[[#This Row],[Autor(in)]]),\"\")","v":""},{"$f":"IF(Tabelle_Auswertung[[#This Row],[Platz]]=8,CONCATENATE(Tabelle_Auswertung[[#This Row],[Bildname]],\" von \",Tabelle_Auswertung[[#This Row],[Autor(in)]]),\"\")","v":""},{"$f":"IF(Tabelle_Auswertung[[#This Row],[Platz]]=9,CONCATENATE(Tabelle_Auswertung[[#This Row],[Bildname]],\" von \",Tabelle_Auswertung[[#This Row],[Autor(in)]]),\"\")","v":""},{"$f":"IF(Tabelle_Auswertung[[#This Row],[Platz]]=10,CONCATENATE(Tabelle_Auswertung[[#This Row],[Bildname]],\" von \",Tabelle_Auswertung[[#This Row],[Autor(in)]]),\"\")","v":""}]
[102,{"$nulls":21},{"$f":"IF(Tabelle_Auswertung[[#This Row],[Bildname]]<>\"\",\n    IF(Tabelle_Auswertung[[#This Row],[abwesend]]=\"ja\",\n        SUM(Tabelle_Auswertung[[#This Row],[Juror 1]:[Juror 20]])/COUNT(Tabelle_Auswertung[[#This Row],[Juror 1]:[Juror 20]])*(COUNT(Tabelle_Auswertung[[#This Row],[Juror 1]:[Juror 20]])-1),\n        SUM(Tabelle_Auswertung[[#This Row],[Juror 1]:[Juror 20]])\n    ),\n\" - \")","v":" - "},{"$f":"IF(Tabelle_Auswertung[[#This Row],[Bildname]]<>\"\",IF(Tabelle_Auswertung[[#This Row],[Punkte]]>0,AVERAGE(Tabelle_Auswertung[[#This Row],[Juror 1]:[Juror 20]]),\" - \"),\" - \")","v":" - "},{"$f":"IF(Tabelle_Auswertung[[#This Row],[Bildname]]<>\"\",IF(Tabelle_Auswertung[[#This Row],[Punkte]]>0,RANK(Tabelle_Auswertung[[#This Row],[Punkte]],[Punkte],0),\" - \"),\" - \")","v":" - "}," - - -",null,{"$f":"IF(Tabelle_Auswertung[[#This Row],[Platz]]=1,CONCATENATE(Tabelle_Auswertung[[#This Row],[Bildname]],\" von \",Tabelle_Auswertung[[#This Row],[Autor(in)]]),\"\")","v":""},{"$f":"IF(Tabelle_Auswertung[[#This Row],[Platz]]=2,CONCATENATE(Tabelle_Auswertung[[#This Row],[Bildname]],\" von \",Tabelle_Auswertung[[#This Row],[Autor(in)]]),\"\")","v":""},{"$f":"IF(Tabelle_Auswertung[[#This Row],[Platz]]=3,CONCATENATE(Tabelle_Auswertung[[#This Row],[Bildname]],\" von \",Tabelle_Auswertung[[#This Row],[Autor(in)]]),\"\")","v":""},{"$f":"IF(Tabelle_Auswertung[[#This Row],[Platz]]=4,CONCATENATE(Tabelle_Auswertung[[#This Row],[Bildname]],\" von \",Tabelle_Auswertung[[#This Row],[Autor(in)]]),\"\")","v":""},{"$f":"IF(Tabelle_Auswertung[[#This Row],[Platz]]=5,CONCATENATE(Tabelle_Auswertung[[#This Row],[Bildname]],\" von \",Tabelle_Auswertung[[#This Row],[Autor(in)]]),\"\")","v":""},{"$f":"IF(Tabelle_Auswertung[[#This Row],[Platz]]=6,CONCATENATE(Tabelle_Auswertung[[#This Row],[Bildname]],\" von \",Tabelle_Auswertung[[#This Row],[Autor(in)]]),\"\")","v":""},{"$f":"IF(Tabelle_Auswertung[[#This Row],[Platz]]=7,CONCATENATE(Tabelle_Auswertung[[#This Row],[Bildname]],\" von \",Tabelle_Auswertung[[#This Row],[Autor(in)]]),\"\")","v":""},{"$f":"IF(Tabelle_Auswertung[[#This Row],[Platz]]=8,CONCATENATE(Tabelle_Auswertung[[#This Row],[Bildname]],\" von \",Tabelle_Auswertung[[#This Row],[Autor(in)]]),\"\")","v":""},{"$f":"IF(Tabelle_Auswertung[[#This Row],[Platz]]=9,CONCATENATE(Tabelle_Auswertung[[#This Row],[Bildname]],\" von \",Tabelle_Auswertung[[#This Row],[Autor(in)]]),\"\")","v":""},{"$f":"IF(Tabelle_Auswertung[[#This Row],[Platz]]=10,CONCATENATE(Tabelle_Auswertung[[#This Row],[Bildname]],\" von \",Tabelle_Auswertung[[#This Row],[Autor(in)]]),\"\")","v":""}]
[103,{"$nulls":21},{"$f":"IF(Tabelle_Auswertung[[#This Row],[Bildname]]<>\"\",\n    IF(Tabelle_Auswertung[[#This Row],[abwesend]]=\"ja\",\n        SUM(Tabelle_Auswertung[[#This Row],[Juror 1]:[Juror 20]])/COUNT(Tabelle_Auswertung[[#This Row],[Juror 1]:[Juror 20]])*(COUNT(Tabelle_Auswertung[[#This Row],[Juror 1]:[Juror 20]])-1),\n        SUM(Tabelle_Auswertung[[#This Row],[Juror 1]:[Juror 20]])\n    ),\n\" - \")","v":" - "},{"$f":"IF(Tabelle_Auswertung[[#This Row],[Bildname]]<>\"\",IF(Tabelle_Auswertung[[#This Row],[Punkte]]>0,AVERAGE(Tabelle_Auswertung[[#This Row],[Juror 1]:[Juror 20]]),\" - \"),\" - \")","v":" - "},{"$f":"IF(Tabelle_Auswertung[[#This Row],[Bildname]]<>\"\",IF(Tabelle_Auswertung[[#This Row],[Punkte]]>0,RANK(Tabelle_Auswertung[[#This Row],[Punkte]],[Punkte],0),\" - \"),\" - \")","v":" - "}," - - -",null,{"$f":"IF(Tabelle_Auswertung[[#This Row],[Platz]]=1,CONCATENATE(Tabelle_Auswertung[[#This Row],[Bildname]],\" von \",Tabelle_Auswertung[[#This Row],[Autor(in)]]),\"\")","v":""},{"$f":"IF(Tabelle_Auswertung[[#This Row],[Platz]]=2,CONCATENATE(Tabelle_Auswertung[[#This Row],[Bildname]],\" von \",Tabelle_Auswertung[[#This Row],[Autor(in)]]),\"\")","v":""},{"$f":"IF(Tabelle_Auswertung[[#This Row],[Platz]]=3,CONCATENATE(Tabelle_Auswertung[[#This Row],[Bildname]],\" von \",Tabelle_Auswertung[[#This Row],[Autor(in)]]),\"\")","v":""},{"$f":"IF(Tabelle_Auswertung[[#This Row],[Platz]]=4,CONCATENATE(Tabelle_Auswertung[[#This Row],[Bildname]],\" von \",Tabelle_Auswertung[[#This Row],[Autor(in)]]),\"\")","v":""},{"$f":"IF(Tabelle_Auswertung[[#This Row],[Platz]]=5,CONCATENATE(Tabelle_Auswertung[[#This Row],[Bildname]],\" von \",Tabelle_Auswertung[[#This Row],[Autor(in)]]),\"\")","v":""},{"$f":"IF(Tabelle_Auswertung[[#This Row],[Platz]]=6,CONCATENATE(Tabelle_Auswertung[[#This Row],[Bildname]],\" von \",Tabelle_Auswertung[[#This Row],[Autor(in)]]),\"\")","v":""},{"$f":"IF(Tabelle_Auswertung[[#This Row],[Platz]]=7,CONCATENATE(Tabelle_Auswertung[[#This Row],[Bildname]],\" von \",Tabelle_Auswertung[[#This Row],[Autor(in)]]),\"\")","v":""},{"$f":"IF(Tabelle_Auswertung[[#This Row],[Platz]]=8,CONCATENATE(Tabelle_Auswertung[[#This Row],[Bildname]],\" von \",Tabelle_Auswertung[[#This Row],[Autor(in)]]),\"\")","v":""},{"$f":"IF(Tabelle_Auswertung[[#This Row],[Platz]]=9,CONCATENATE(Tabelle_Auswertung[[#This Row],[Bildname]],\" von \",Tabelle_Auswertung[[#This Row],[Autor(in)]]),\"\")","v":""},{"$f":"IF(Tabelle_Auswertung[[#This Row],[Platz]]=10,CONCATENATE(Tabelle_Auswertung[[#This Row],[Bildname]],\" von \",Tabelle_Auswertung[[#This Row],[Autor(in)]]),\"\")","v":""}]
[104,{"$nulls":21},{"$f":"IF(Tabelle_Auswertung[[#This Row],[Bildname]]<>\"\",\n    IF(Tabelle_Auswertung[[#This Row],[abwesend]]=\"ja\",\n        SUM(Tabelle_Auswertung[[#This Row],[Juror 1]:[Juror 20]])/COUNT(Tabelle_Auswertung[[#This Row],[Juror 1]:[Juror 20]])*(COUNT(Tabelle_Auswertung[[#This Row],[Juror 1]:[Juror 20]])-1),\n        SUM(Tabelle_Auswertung[[#This Row],[Juror 1]:[Juror 20]])\n    ),\n\" - \")","v":" - "},{"$f":"IF(Tabelle_Auswertung[[#This Row],[Bildname]]<>\"\",IF(Tabelle_Auswertung[[#This Row],[Punkte]]>0,AVERAGE(Tabelle_Auswertung[[#This Row],[Juror 1]:[Juror 20]]),\" - \"),\" - \")","v":" - "},{"$f":"IF(Tabelle_Auswertung[[#This Row],[Bildname]]<>\"\",IF(Tabelle_Auswertung[[#This Row],[Punkte]]>0,RANK(Tabelle_Auswertung[[#This Row],[Punkte]],[Punkte],0),\" - \"),\" - \")","v":" - "}," - - -",null,{"$f":"IF(Tabelle_Auswertung[[#This Row],[Platz]]=1,CONCATENATE(Tabelle_Auswertung[[#This Row],[Bildname]],\" von \",Tabelle_Auswertung[[#This Row],[Autor(in)]]),\"\")","v":""},{"$f":"IF(Tabelle_Auswertung[[#This Row],[Platz]]=2,CONCATENATE(Tabelle_Auswertung[[#This Row],[Bildname]],\" von \",Tabelle_Auswertung[[#This Row],[Autor(in)]]),\"\")","v":""},{"$f":"IF(Tabelle_Auswertung[[#This Row],[Platz]]=3,CONCATENATE(Tabelle_Auswertung[[#This Row],[Bildname]],\" von \",Tabelle_Auswertung[[#This Row],[Autor(in)]]),\"\")","v":""},{"$f":"IF(Tabelle_Auswertung[[#This Row],[Platz]]=4,CONCATENATE(Tabelle_Auswertung[[#This Row],[Bildname]],\" von \",Tabelle_Auswertung[[#This Row],[Autor(in)]]),\"\")","v":""},{"$f":"IF(Tabelle_Auswertung[[#This Row],[Platz]]=5,CONCATENATE(Tabelle_Auswertung[[#This Row],[Bildname]],\" von \",Tabelle_Auswertung[[#This Row],[Autor(in)]]),\"\")","v":""},{"$f":"IF(Tabelle_Auswertung[[#This Row],[Platz]]=6,CONCATENATE(Tabelle_Auswertung[[#This Row],[Bildname]],\" von \",Tabelle_Auswertung[[#This Row],[Autor(in)]]),\"\")","v":""},{"$f":"IF(Tabelle_Auswertung[[#This Row],[Platz]]=7,CONCATENATE(Tabelle_Auswertung[[#This Row],[Bildname]],\" von \",Tabelle_Auswertung[[#This Row],[Autor(in)]]),\"\")","v":""},{"$f":"IF(Tabelle_Auswertung[[#This Row],[Platz]]=8,CONCATENATE(Tabelle_Auswertung[[#This Row],[Bildname]],\" von \",Tabelle_Auswertung[[#This Row],[Autor(in)]]),\"\")","v":""},{"$f":"IF(Tabelle_Auswertung[[#This Row],[Platz]]=9,CONCATENATE(Tabelle_Auswertung[[#This Row],[Bildname]],\" von \",Tabelle_Auswertung[[#This Row],[Autor(in)]]),\"\")","v":""},{"$f":"IF(Tabelle_Auswertung[[#This Row],[Platz]]=10,CONCATENATE(Tabelle_Auswertung[[#This Row],[Bildname]],\" von \",Tabelle_Auswertung[[#This Row],[Autor(in)]]),\"\")","v":""}]
[105,{"$nulls":21},{"$f":"IF(Tabelle_Auswertung[[#This Row],[Bildname]]<>\"\",\n    IF(Tabelle_Auswertung[[#This Row],[abwesend]]=\"ja\",\n        SUM(Tabelle_Auswertung[[#This Row],[Juror 1]:[Juror 20]])/COUNT(Tabelle_Auswertung[[#This Row],[Juror 1]:[Juror 20]])*(COUNT(Tabelle_Auswertung[[#This Row],[Juror 1]:[Juror 20]])-1),\n        SUM(Tabelle_Auswertung[[#This Row],[Juror 1]:[Juror 20]])\n    ),\n\" - \")","v":" - "},{"$f":"IF(Tabelle_Auswertung[[#This Row],[Bildname]]<>\"\",IF(Tabelle_Auswertung[[#This Row],[Punkte]]>0,AVERAGE(Tabelle_Auswertung[[#This Row],[Juror 1]:[Juror 20]]),\" - \"),\" - \")","v":" - "},{"$f":"IF(Tabelle_Auswertung[[#This Row],[Bildname]]<>\"\",IF(Tabelle_Auswertung[[#This Row],[Punkte]]>0,RANK(Tabelle_Auswertung[[#This Row],[Punkte]],[Punkte],0),\" - \"),\" - \")","v":" - "}," - - -",null,{"$f":"IF(Tabelle_Auswertung[[#This Row],[Platz]]=1,CONCATENATE(Tabelle_Auswertung[[#This Row],[Bildname]],\" von \",Tabelle_Auswertung[[#This Row],[Autor(in)]]),\"\")","v":""},{"$f":"IF(Tabelle_Auswertung[[#This Row],[Platz]]=2,CONCATENATE(Tabelle_Auswertung[[#This Row],[Bildname]],\" von \",Tabelle_Auswertung[[#This Row],[Autor(in)]]),\"\")","v":""},{"$f":"IF(Tabelle_Auswertung[[#This Row],[Platz]]=3,CONCATENATE(Tabelle_Auswertung[[#This Row],[Bildname]],\" von \",Tabelle_Auswertung[[#This Row],[Autor(in)]]),\"\")","v":""},{"$f":"IF(Tabelle_Auswertung[[#This Row],[Platz]]=4,CONCATENATE(Tabelle_Auswertung[[#This Row],[Bildname]],\" von \",Tabelle_Auswertung[[#This Row],[Autor(in)]]),\"\")","v":""},{"$f":"IF(Tabelle_Auswertung[[#This Row],[Platz]]=5,CONCATENATE(Tabelle_Auswertung[[#This Row],[Bildname]],\" von \",Tabelle_Auswertung[[#This Row],[Autor(in)]]),\"\")","v":""},{"$f":"IF(Tabelle_Auswertung[[#This Row],[Platz]]=6,CONCATENATE(Tabelle_Auswertung[[#This Row],[Bildname]],\" von \",Tabelle_Auswertung[[#This Row],[Autor(in)]]),\"\")","v":""},{"$f":"IF(Tabelle_Auswertung[[#This Row],[Platz]]=7,CONCATENATE(Tabelle_Auswertung[[#This Row],[Bildname]],\" von \",Tabelle_Auswertung[[#This Row],[Autor(in)]]),\"\")","v":""},{"$f":"IF(Tabelle_Auswertung[[#This Row],[Platz]]=8,CONCATENATE(Tabelle_Auswertung[[#This Row],[Bildname]],\" von \",Tabelle_Auswertung[[#This Row],[Autor(in)]]),\"\")","v":""},{"$f":"IF(Tabelle_Auswertung[[#This Row],[Platz]]=9,CONCATENATE(Tabelle_Auswertung[[#This Row],[Bildname]],\" von \",Tabelle_Auswertung[[#This Row],[Autor(in)]]),\"\")","v":""},{"$f":"IF(Tabelle_Auswertung[[#This Row],[Platz]]=10,CONCATENATE(Tabelle_Auswertung[[#This Row],[Bildname]],\" von \",Tabelle_Auswertung[[#This Row],[Autor(in)]]),\"\")","v":""}]
[106,{"$nulls":21},{"$f":"IF(Tabelle_Auswertung[[#This Row],[Bildname]]<>\"\",\n    IF(Tabelle_Auswertung[[#This Row],[abwesend]]=\"ja\",\n        SUM(Tabelle_Auswertung[[#This Row],[Juror 1]:[Juror 20]])/COUNT(Tabelle_Auswertung[[#This Row],[Juror 1]:[Juror 20]])*(COUNT(Tabelle_Auswertung[[#This Row],[Juror 1]:[Juror 20]])-1),\n        SUM(Tabelle_Auswertung[[#This Row],[Juror 1]:[Juror 20]])\n    ),\n\" - \")","v":" - "},{"$f":"IF(Tabelle_Auswertung[[#This Row],[Bildname]]<>\"\",IF(Tabelle_Auswertung[[#This Row],[Punkte]]>0,AVERAGE(Tabelle_Auswertung[[#This Row],[Juror 1]:[Juror 20]]),\" - \"),\" - \")","v":" - "},{"$f":"IF(Tabelle_Auswertung[[#This Row],[Bildname]]<>\"\",IF(Tabelle_Auswertung[[#This Row],[Punkte]]>0,RANK(Tabelle_Auswertung[[#This Row],[Punkte]],[Punkte],0),\" - \"),\" - \")","v":" - "}," - - -",null,{"$f":"IF(Tabelle_Auswertung[[#This Row],[Platz]]=1,CONCATENATE(Tabelle_Auswertung[[#This Row],[Bildname]],\" von \",Tabelle_Auswertung[[#This Row],[Autor(in)]]),\"\")","v":""},{"$f":"IF(Tabelle_Auswertung[[#This Row],[Platz]]=2,CONCATENATE(Tabelle_Auswertung[[#This Row],[Bildname]],\" von \",Tabelle_Auswertung[[#This Row],[Autor(in)]]),\"\")","v":""},{"$f":"IF(Tabelle_Auswertung[[#This Row],[Platz]]=3,CONCATENATE(Tabelle_Auswertung[[#This Row],[Bildname]],\" von \",Tabelle_Auswertung[[#This Row],[Autor(in)]]),\"\")","v":""},{"$f":"IF(Tabelle_Auswertung[[#This Row],[Platz]]=4,CONCATENATE(Tabelle_Auswertung[[#This Row],[Bildname]],\" von \",Tabelle_Auswertung[[#This Row],[Autor(in)]]),\"\")","v":""},{"$f":"IF(Tabelle_Auswertung[[#This Row],[Platz]]=5,CONCATENATE(Tabelle_Auswertung[[#This Row],[Bildname]],\" von \",Tabelle_Auswertung[[#This Row],[Autor(in)]]),\"\")","v":""},{"$f":"IF(Tabelle_Auswertung[[#This Row],[Platz]]=6,CONCATENATE(Tabelle_Auswertung[[#This Row],[Bildname]],\" von \",Tabelle_Auswertung[[#This Row],[Autor(in)]]),\"\")","v":""},{"$f":"IF(Tabelle_Auswertung[[#This Row],[Platz]]=7,CONCATENATE(Tabelle_Auswertung[[#This Row],[Bildname]],\" von \",Tabelle_Auswertung[[#This Row],[Autor(in)]]),\"\")","v":""},{"$f":"IF(Tabelle_Auswertung[[#This Row],[Platz]]=8,CONCATENATE(Tabelle_Auswertung[[#This Row],[Bildname]],\" von \",Tabelle_Auswertung[[#This Row],[Autor(in)]]),\"\")","v":""},{"$f":"IF(Tabelle_Auswertung[[#This Row],[Platz]]=9,CONCATENATE(Tabelle_Auswertung[[#This Row],[Bildname]],\" von \",Tabelle_Auswertung[[#This Row],[Autor(in)]]),\"\")","v":""},{"$f":"IF(Tabelle_Auswertung[[#This Row],[Platz]]=10,CONCATENATE(Tabelle_Auswertung[[#This Row],[Bildname]],\" von \",Tabelle_Auswertung[[#This Row],[Autor(in)]]),\"\")","v":""}]
[107,{"$nulls":21},{"$f":"IF(Tabelle_Auswertung[[#This Row],[Bildname]]<>\"\",\n    IF(Tabelle_Auswertung[[#This Row],[abwesend]]=\"ja\",\n        SUM(Tabelle_Auswertung[[#This Row],[Juror 1]:[Juror 20]])/COUNT(Tabelle_Auswertung[[#This Row],[Juror 1]:[Juror 20]])*(COUNT(Tabelle_Auswertung[[#This Row],[Juror 1]:[Juror 20]])-1),\n        SUM(Tabelle_Auswertung[[#This Row],[Juror 1]:[Juror 20]])\n    ),\n\" - \")","v":" - "},{"$f":"IF(Tabelle_Auswertung[[#This Row],[Bildname]]<>\"\",IF(Tabelle_Auswertung[[#This Row],[Punkte]]>0,AVERAGE(Tabelle_Auswertung[[#This Row],[Juror 1]:[Juror 20]]),\" - \"),\" - \")","v":" - "},{"$f":"IF(Tabelle_Auswertung[[#This Row],[Bildname]]<>\"\",IF(Tabelle_Auswertung[[#This Row],[Punkte]]>0,RANK(Tabelle_Auswertung[[#This Row],[Punkte]],[Punkte],0),\" - \"),\" - \")","v":" - "}," - - -",null,{"$f":"IF(Tabelle_Auswertung[[#This Row],[Platz]]=1,CONCATENATE(Tabelle_Auswertung[[#This Row],[Bildname]],\" von \",Tabelle_Auswertung[[#This Row],[Autor(in)]]),\"\")","v":""},{"$f":"IF(Tabelle_Auswertung[[#This Row],[Platz]]=2,CONCATENATE(Tabelle_Auswertung[[#This Row],[Bildname]],\" von \",Tabelle_Auswertung[[#This Row],[Autor(in)]]),\"\")","v":""},{"$f":"IF(Tabelle_Auswertung[[#This Row],[Platz]]=3,CONCATENATE(Tabelle_Auswertung[[#This Row],[Bildname]],\" von \",Tabelle_Auswertung[[#This Row],[Autor(in)]]),\"\")","v":""},{"$f":"IF(Tabelle_Auswertung[[#This Row],[Platz]]=4,CONCATENATE(Tabelle_Auswertung[[#This Row],[Bildname]],\" von \",Tabelle_Auswertung[[#This Row],[Autor(in)]]),\"\")","v":""},{"$f":"IF(Tabelle_Auswertung[[#This Row],[Platz]]=5,CONCATENATE(Tabelle_Auswertung[[#This Row],[Bildname]],\" von \",Tabelle_Auswertung[[#This Row],[Autor(in)]]),\"\")","v":""},{"$f":"IF(Tabelle_Auswertung[[#This Row],[Platz]]=6,CONCATENATE(Tabelle_Auswertung[[#This Row],[Bildname]],\" von \",Tabelle_Auswertung[[#This Row],[Autor(in)]]),\"\")","v":""},{"$f":"IF(Tabelle_Auswertung[[#This Row],[Platz]]=7,CONCATENATE(Tabelle_Auswertung[[#This Row],[Bildname]],\" von \",Tabelle_Auswertung[[#This Row],[Autor(in)]]),\"\")","v":""},{"$f":"IF(Tabelle_Auswertung[[#This Row],[Platz]]=8,CONCATENATE(Tabelle_Auswertung[[#This Row],[Bildname]],\" von \",Tabelle_Auswertung[[#This Row],[Autor(in)]]),\"\")","v":""},{"$f":"IF(Tabelle_Auswertung[[#This Row],[Platz]]=9,CONCATENATE(Tabelle_Auswertung[[#This Row],[Bildname]],\" von \",Tabelle_Auswertung[[#This Row],[Autor(in)]]),\"\")","v":""},{"$f":"IF(Tabelle_Auswertung[[#This Row],[Platz]]=10,CONCATENATE(Tabelle_Auswertung[[#This Row],[Bildname]],\" von \",Tabelle_Auswertung[[#This Row],[Autor(in)]]),\"\")","v":""}]
[108,{"$nulls":21},{"$f":"IF(Tabelle_Auswertung[[#This Row],[Bildname]]<>\"\",\n    IF(Tabelle_Auswertung[[#This Row],[abwesend]]=\"ja\",\n        SUM(Tabelle_Auswertung[[#This Row],[Juror 1]:[Juror 20]])/COUNT(Tabelle_Auswertung[[#This Row],[Juror 1]:[Juror 20]])*(COUNT(Tabelle_Auswertung[[#This Row],[Juror 1]:[Juror 20]])-1),\n        SUM(Tabelle_Auswertung[[#This Row],[Juror 1]:[Juror 20]])\n    ),\n\" - \")","v":" - "},{"$f":"IF(Tabelle_Auswertung[[#This Row],[Bildname]]<>\"\",IF(Tabelle_Auswertung[[#This Row],[Punkte]]>0,AVERAGE(Tabelle_Auswertung[[#This Row],[Juror 1]:[Juror 20]]),\" - \"),\" - \")","v":" - "},{"$f":"IF(Tabelle_Auswertung[[#This Row],[Bildname]]<>\"\",IF(Tabelle_Auswertung[[#This Row],[Punkte]]>0,RANK(Tabelle_Auswertung[[#This Row],[Punkte]],[Punkte],0),\" - \"),\" - \")","v":" - "}," - - -",null,{"$f":"IF(Tabelle_Auswertung[[#This Row],[Platz]]=1,CONCATENATE(Tabelle_Auswertung[[#This Row],[Bildname]],\" von \",Tabelle_Auswertung[[#This Row],[Autor(in)]]),\"\")","v":""},{"$f":"IF(Tabelle_Auswertung[[#This Row],[Platz]]=2,CONCATENATE(Tabelle_Auswertung[[#This Row],[Bildname]],\" von \",Tabelle_Auswertung[[#This Row],[Autor(in)]]),\"\")","v":""},{"$f":"IF(Tabelle_Auswertung[[#This Row],[Platz]]=3,CONCATENATE(Tabelle_Auswertung[[#This Row],[Bildname]],\" von \",Tabelle_Auswertung[[#This Row],[Autor(in)]]),\"\")","v":""},{"$f":"IF(Tabelle_Auswertung[[#This Row],[Platz]]=4,CONCATENATE(Tabelle_Auswertung[[#This Row],[Bildname]],\" von \",Tabelle_Auswertung[[#This Row],[Autor(in)]]),\"\")","v":""},{"$f":"IF(Tabelle_Auswertung[[#This Row],[Platz]]=5,CONCATENATE(Tabelle_Auswertung[[#This Row],[Bildname]],\" von \",Tabelle_Auswertung[[#This Row],[Autor(in)]]),\"\")","v":""},{"$f":"IF(Tabelle_Auswertung[[#This Row],[Platz]]=6,CONCATENATE(Tabelle_Auswertung[[#This Row],[Bildname]],\" von \",Tabelle_Auswertung[[#This Row],[Autor(in)]]),\"\")","v":""},{"$f":"IF(Tabelle_Auswertung[[#This Row],[Platz]]=7,CONCATENATE(Tabelle_Auswertung[[#This Row],[Bildname]],\" von \",Tabelle_Auswertung[[#This Row],[Autor(in)]]),\"\")","v":""},{"$f":"IF(Tabelle_Auswertung[[#This Row],[Platz]]=8,CONCATENATE(Tabelle_Auswertung[[#This Row],[Bildname]],\" von \",Tabelle_Auswertung[[#This Row],[Autor(in)]]),\"\")","v":""},{"$f":"IF(Tabelle_Auswertung[[#This Row],[Platz]]=9,CONCATENATE(Tabelle_Auswertung[[#This Row],[Bildname]],\" von \",Tabelle_Auswertung[[#This Row],[Autor(in)]]),\"\")","v":""},{"$f":"IF(Tabelle_Auswertung[[#This Row],[Platz]]=10,CONCATENATE(Tabelle_Auswertung[[#This Row],[Bildname]],\" von \",Tabelle_Auswertung[[#This Row],[Autor(in)]]),\"\")","v":""}]
[109,{"$nulls":21},{"$f":"IF(Tabelle_Auswertung[[#This Row],[Bildname]]<>\"\",\n    IF(Tabelle_Auswertung[[#This Row],[abwesend]]=\"ja\",\n        SUM(Tabelle_Auswertung[[#This Row],[Juror 1]:[Juror 20]])/COUNT(Tabelle_Auswertung[[#This Row],[Juror 1]:[Juror 20]])*(COUNT(Tabelle_Auswertung[[#This Row],[Juror 1]:[Juror 20]])-1),\n        SUM(Tabelle_Auswertung[[#This Row],[Juror 1]:[Juror 20]])\n    ),\n\" - \")","v":" - "},{"$f":"IF(Tabelle_Auswertung[[#This Row],[Bildname]]<>\"\",IF(Tabelle_Auswertung[[#This Row],[Punkte]]>0,AVERAGE(Tabelle_Auswertung[[#This Row],[Juror 1]:[Juror 20]]),\" - \"),\" - \")","v":" - "},{"$f":"IF(Tabelle_Auswertung[[#This Row],[Bildname]]<>\"\",IF(Tabelle_Auswertung[[#This Row],[Punkte]]>0,RANK(Tabelle_Auswertung[[#This Row],[Punkte]],[Punkte],0),\" - \"),\" - \")","v":" - "}," - - -",null,{"$f":"IF(Tabelle_Auswertung[[#This Row],[Platz]]=1,CONCATENATE(Tabelle_Auswertung[[#This Row],[Bildname]],\" von \",Tabelle_Auswertung[[#This Row],[Autor(in)]]),\"\")","v":""},{"$f":"IF(Tabelle_Auswertung[[#This Row],[Platz]]=2,CONCATENATE(Tabelle_Auswertung[[#This Row],[Bildname]],\" von \",Tabelle_Auswertung[[#This Row],[Autor(in)]]),\"\")","v":""},{"$f":"IF(Tabelle_Auswertung[[#This Row],[Platz]]=3,CONCATENATE(Tabelle_Auswertung[[#This Row],[Bildname]],\" von \",Tabelle_Auswertung[[#This Row],[Autor(in)]]),\"\")","v":""},{"$f":"IF(Tabelle_Auswertung[[#This Row],[Platz]]=4,CONCATENATE(Tabelle_Auswertung[[#This Row],[Bildname]],\" von \",Tabelle_Auswertung[[#This Row],[Autor(in)]]),\"\")","v":""},{"$f":"IF(Tabelle_Auswertung[[#This Row],[Platz]]=5,CONCATENATE(Tabelle_Auswertung[[#This Row],[Bildname]],\" von \",Tabelle_Auswertung[[#This Row],[Autor(in)]]),\"\")","v":""},{"$f":"IF(Tabelle_Auswertung[[#This Row],[Platz]]=6,CONCATENATE(Tabelle_Auswertung[[#This Row],[Bildname]],\" von \",Tabelle_Auswertung[[#This Row],[Autor(in)]]),\"\")","v":""},{"$f":"IF(Tabelle_Auswertung[[#This Row],[Platz]]=7,CONCATENATE(Tabelle_Auswertung[[#This Row],[Bildname]],\" von \",Tabelle_Auswertung[[#This Row],[Autor(in)]]),\"\")","v":""},{"$f":"IF(Tabelle_Auswertung[[#This Row],[Platz]]=8,CONCATENATE(Tabelle_Auswertung[[#This Row],[Bildname]],\" von \",Tabelle_Auswertung[[#This Row],[Autor(in)]]),\"\")","v":""},{"$f":"IF(Tabelle_Auswertung[[#This Row],[Platz]]=9,CONCATENATE(Tabelle_Auswertung[[#This Row],[Bildname]],\" von \",Tabelle_Auswertung[[#This Row],[Autor(in)]]),\"\")","v":""},{"$f":"IF(Tabelle_Auswertung[[#This Row],[Platz]]=10,CONCATENATE(Tabelle_Auswertung[[#This Row],[Bildname]],\" von \",Tabelle_Auswertung[[#This Row],[Autor(in)]]),\"\")","v":""}]
[110,{"$nulls":21},{"$f":"IF(Tabelle_Auswertung[[#This Row],[Bildname]]<>\"\",\n    IF(Tabelle_Auswertung[[#This Row],[abwesend]]=\"ja\",\n        SUM(Tabelle_Auswertung[[#This Row],[Juror 1]:[Juror 20]])/COUNT(Tabelle_Auswertung[[#This Row],[Juror 1]:[Juror 20]])*(COUNT(Tabelle_Auswertung[[#This Row],[Juror 1]:[Juror 20]])-1),\n        SUM(Tabelle_Auswertung[[#This Row],[Juror 1]:[Juror 20]])\n    ),\n\" - \")","v":" - "},{"$f":"IF(Tabelle_Auswertung[[#This Row],[Bildname]]<>\"\",IF(Tabelle_Auswertung[[#This Row],[Punkte]]>0,AVERAGE(Tabelle_Auswertung[[#This Row],[Juror 1]:[Juror 20]]),\" - \"),\" - \")","v":" - "},{"$f":"IF(Tabelle_Auswertung[[#This Row],[Bildname]]<>\"\",IF(Tabelle_Auswertung[[#This Row],[Punkte]]>0,RANK(Tabelle_Auswertung[[#This Row],[Punkte]],[Punkte],0),\" - \"),\" - \")","v":" - "}," - - -",null,{"$f":"IF(Tabelle_Auswertung[[#This Row],[Platz]]=1,CONCATENATE(Tabelle_Auswertung[[#This Row],[Bildname]],\" von \",Tabelle_Auswertung[[#This Row],[Autor(in)]]),\"\")","v":""},{"$f":"IF(Tabelle_Auswertung[[#This Row],[Platz]]=2,CONCATENATE(Tabelle_Auswertung[[#This Row],[Bildname]],\" von \",Tabelle_Auswertung[[#This Row],[Autor(in)]]),\"\")","v":""},{"$f":"IF(Tabelle_Auswertung[[#This Row],[Platz]]=3,CONCATENATE(Tabelle_Auswertung[[#This Row],[Bildname]],\" von \",Tabelle_Auswertung[[#This Row],[Autor(in)]]),\"\")","v":""},{"$f":"IF(Tabelle_Auswertung[[#This Row],[Platz]]=4,CONCATENATE(Tabelle_Auswertung[[#This Row],[Bildname]],\" von \",Tabelle_Auswertung[[#This Row],[Autor(in)]]),\"\")","v":""},{"$f":"IF(Tabelle_Auswertung[[#This Row],[Platz]]=5,CONCATENATE(Tabelle_Auswertung[[#This Row],[Bildname]],\" von \",Tabelle_Auswertung[[#This Row],[Autor(in)]]),\"\")","v":""},{"$f":"IF(Tabelle_Auswertung[[#This Row],[Platz]]=6,CONCATENATE(Tabelle_Auswertung[[#This Row],[Bildname]],\" von \",Tabelle_Auswertung[[#This Row],[Autor(in)]]),\"\")","v":""},{"$f":"IF(Tabelle_Auswertung[[#This Row],[Platz]]=7,CONCATENATE(Tabelle_Auswertung[[#This Row],[Bildname]],\" von \",Tabelle_Auswertung[[#This Row],[Autor(in)]]),\"\")","v":""},{"$f":"IF(Tabelle_Auswertung[[#This Row],[Platz]]=8,CONCATENATE(Tabelle_Auswertung[[#This Row],[Bildname]],\" von \",Tabelle_Auswertung[[#This Row],[Autor(in)]]),\"\")","v":""},{"$f":"IF(Tabelle_Auswertung[[#This Row],[Platz]]=9,CONCATENATE(Tabelle_Auswertung[[#This Row],[Bildname]],\" von \",Tabelle_Auswertung[[#This Row],[Autor(in)]]),\"\")","v":""},{"$f":"IF(Tabelle_Auswertung[[#This Row],[Platz]]=10,CONCATENATE(Tabelle_Auswertung[[#This Row],[Bildname]],\" von \",Tabelle_Auswertung[[#This Row],[Autor(in)]]),\"\")","v":""}]
[111,{"$nulls":21},{"$f":"IF(Tabelle_Auswertung[[#This Row],[Bildname]]<>\"\",\n    IF(Tabelle_Auswertung[[#This Row],[abwesend]]=\"ja\",\n        SUM(Tabelle_Auswertung[[#This Row],[Juror 1]:[Juror 20]])/COUNT(Tabelle_Auswertung[[#This Row],[Juror 1]:[Juror 20]])*(COUNT(Tabelle_Auswertung[[#This Row],[Juror 1]:[Juror 20]])-1),\n        SUM(Tabelle_Auswertung[[#This Row],[Juror 1]:[Juror 20]])\n    ),\n\" - \")","v":" - "},{"$f":"IF(Tabelle_Auswertung[[#This Row],[Bildname]]<>\"\",IF(Tabelle_Auswertung[[#This Row],[Punkte]]>0,AVERAGE(Tabelle_Auswertung[[#This Row],[Juror 1]:[Juror 20]]),\" - \"),\" - \")","v":" - "},{"$f":"IF(Tabelle_Auswertung[[#This Row],[Bildname]]<>\"\",IF(Tabelle_Auswertung[[#This Row],[Punkte]]>0,RANK(Tabelle_Auswertung[[#This Row],[Punkte]],[Punkte],0),\" - \"),\" - \")","v":" - "}," - - -",null,{"$f":"IF(Tabelle_Auswertung[[#This Row],[Platz]]=1,CONCATENATE(Tabelle_Auswertung[[#This Row],[Bildname]],\" von \",Tabelle_Auswertung[[#This Row],[Autor(in)]]),\"\")","v":""},{"$f":"IF(Tabelle_Auswertung[[#This Row],[Platz]]=2,CONCATENATE(Tabelle_Auswertung[[#This Row],[Bildname]],\" von \",Tabelle_Auswertung[[#This Row],[Autor(in)]]),\"\")","v":""},{"$f":"IF(Tabelle_Auswertung[[#This Row],[Platz]]=3,CONCATENATE(Tabelle_Auswertung[[#This Row],[Bildname]],\" von \",Tabelle_Auswertung[[#This Row],[Autor(in)]]),\"\")","v":""},{"$f":"IF(Tabelle_Auswertung[[#This Row],[Platz]]=4,CONCATENATE(Tabelle_Auswertung[[#This Row],[Bildname]],\" von \",Tabelle_Auswertung[[#This Row],[Autor(in)]]),\"\")","v":""},{"$f":"IF(Tabelle_Auswertung[[#This Row],[Platz]]=5,CONCATENATE(Tabelle_Auswertung[[#This Row],[Bildname]],\" von \",Tabelle_Auswertung[[#This Row],[Autor(in)]]),\"\")","v":""},{"$f":"IF(Tabelle_Auswertung[[#This Row],[Platz]]=6,CONCATENATE(Tabelle_Auswertung[[#This Row],[Bildname]],\" von \",Tabelle_Auswertung[[#This Row],[Autor(in)]]),\"\")","v":""},{"$f":"IF(Tabelle_Auswertung[[#This Row],[Platz]]=7,CONCATENATE(Tabelle_Auswertung[[#This Row],[Bildname]],\" von \",Tabelle_Auswertung[[#This Row],[Autor(in)]]),\"\")","v":""},{"$f":"IF(Tabelle_Auswertung[[#This Row],[Platz]]=8,CONCATENATE(Tabelle_Auswertung[[#This Row],[Bildname]],\" von \",Tabelle_Auswertung[[#This Row],[Autor(in)]]),\"\")","v":""},{"$f":"IF(Tabelle_Auswertung[[#This Row],[Platz]]=9,CONCATENATE(Tabelle_Auswertung[[#This Row],[Bildname]],\" von \",Tabelle_Auswertung[[#This Row],[Autor(in)]]),\"\")","v":""},{"$f":"IF(Tabelle_Auswertung[[#This Row],[Platz]]=10,CONCATENATE(Tabelle_Auswertung[[#This Row],[Bildname]],\" von \",Tabelle_Auswertung[[#This Row],[Autor(in)]]),\"\")","v":""}]
[112,{"$nulls":21},{"$f":"IF(Tabelle_Auswertung[[#This Row],[Bildname]]<>\"\",\n    IF(Tabelle_Auswertung[[#This Row],[abwesend]]=\"ja\",\n        SUM(Tabelle_Auswertung[[#This Row],[Juror 1]:[Juror 20]])/COUNT(Tabelle_Auswertung[[#This Row],[Juror 1]:[Juror 20]])*(COUNT(Tabelle_Auswertung[[#This Row],[Juror 1]:[Juror 20]])-1),\n        SUM(Tabelle_Auswertung[[#This Row],[Juror 1]:[Juror 20]])\n    ),\n\" - \")","v":" - "},{"$f":"IF(Tabelle_Auswertung[[#This Row],[Bildname]]<>\"\",IF(Tabelle_Auswertung[[#This Row],[Punkte]]>0,AVERAGE(Tabelle_Auswertung[[#This Row],[Juror 1]:[Juror 20]]),\" - \"),\" - \")","v":" - "},{"$f":"IF(Tabelle_Auswertung[[#This Row],[Bildname]]<>\"\",IF(Tabelle_Auswertung[[#This Row],[Punkte]]>0,RANK(Tabelle_Auswertung[[#This Row],[Punkte]],[Punkte],0),\" - \"),\" - \")","v":" - "}," - - -",null,{"$f":"IF(Tabelle_Auswertung[[#This Row],[Platz]]=1,CONCATENATE(Tabelle_Auswertung[[#This Row],[Bildname]],\" von \",Tabelle_Auswertung[[#This Row],[Autor(in)]]),\"\")","v":""},{"$f":"IF(Tabelle_Auswertung[[#This Row],[Platz]]=2,CONCATENATE(Tabelle_Auswertung[[#This Row],[Bildname]],\" von \",Tabelle_Auswertung[[#This Row],[Autor(in)]]),\"\")","v":""},{"$f":"IF(Tabelle_Auswertung[[#This Row],[Platz]]=3,CONCATENATE(Tabelle_Auswertung[[#This Row],[Bildname]],\" von \",Tabelle_Auswertung[[#This Row],[Autor(in)]]),\"\")","v":""},{"$f":"IF(Tabelle_Auswertung[[#This Row],[Platz]]=4,CONCATENATE(Tabelle_Auswertung[[#This Row],[Bildname]],\" von \",Tabelle_Auswertung[[#This Row],[Autor(in)]]),\"\")","v":""},{"$f":"IF(Tabelle_Auswertung[[#This Row],[Platz]]=5,CONCATENATE(Tabelle_Auswertung[[#This Row],[Bildname]],\" von \",Tabelle_Auswertung[[#This Row],[Autor(in)]]),\"\")","v":""},{"$f":"IF(Tabelle_Auswertung[[#This Row],[Platz]]=6,CONCATENATE(Tabelle_Auswertung[[#This Row],[Bildname]],\" von \",Tabelle_Auswertung[[#This Row],[Autor(in)]]),\"\")","v":""},{"$f":"IF(Tabelle_Auswertung[[#This Row],[Platz]]=7,CONCATENATE(Tabelle_Auswertung[[#This Row],[Bildname]],\" von \",Tabelle_Auswertung[[#This Row],[Autor(in)]]),\"\")","v":""},{"$f":"IF(Tabelle_Auswertung[[#This Row],[Platz]]=8,CONCATENATE(Tabelle_Auswertung[[#This Row],[Bildname]],\" von \",Tabelle_Auswertung[[#This Row],[Autor(in)]]),\"\")","v":""},{"$f":"IF(Tabelle_Auswertung[[#This Row],[Platz]]=9,CONCATENATE(Tabelle_Auswertung[[#This Row],[Bildname]],\" von \",Tabelle_Auswertung[[#This Row],[Autor(in)]]),\"\")","v":""},{"$f":"IF(Tabelle_Auswertung[[#This Row],[Platz]]=10,CONCATENATE(Tabelle_Auswertung[[#This Row],[Bildname]],\" von \",Tabelle_Auswertung[[#This Row],[Autor(in)]]),\"\")","v":""}]
[113,{"$nulls":21},{"$f":"IF(Tabelle_Auswertung[[#This Row],[Bildname]]<>\"\",\n    IF(Tabelle_Auswertung[[#This Row],[abwesend]]=\"ja\",\n        SUM(Tabelle_Auswertung[[#This Row],[Juror 1]:[Juror 20]])/COUNT(Tabelle_Auswertung[[#This Row],[Juror 1]:[Juror 20]])*(COUNT(Tabelle_Auswertung[[#This Row],[Juror 1]:[Juror 20]])-1),\n        SUM(Tabelle_Auswertung[[#This Row],[Juror 1]:[Juror 20]])\n    ),\n\" - \")","v":" - "},{"$f":"IF(Tabelle_Auswertung[[#This Row],[Bildname]]<>\"\",IF(Tabelle_Auswertung[[#This Row],[Punkte]]>0,AVERAGE(Tabelle_Auswertung[[#This Row],[Juror 1]:[Juror 20]]),\" - \"),\" - \")","v":" - "},{"$f":"IF(Tabelle_Auswertung[[#This Row],[Bildname]]<>\"\",IF(Tabelle_Auswertung[[#This Row],[Punkte]]>0,RANK(Tabelle_Auswertung[[#This Row],[Punkte]],[Punkte],0),\" - \"),\" - \")","v":" - "}," - - -",null,{"$f":"IF(Tabelle_Auswertung[[#This Row],[Platz]]=1,CONCATENATE(Tabelle_Auswertung[[#This Row],[Bildname]],\" von \",Tabelle_Auswertung[[#This Row],[Autor(in)]]),\"\")","v":""},{"$f":"IF(Tabelle_Auswertung[[#This Row],[Platz]]=2,CONCATENATE(Tabelle_Auswertung[[#This Row],[Bildname]],\" von \",Tabelle_Auswertung[[#This Row],[Autor(in)]]),\"\")","v":""},{"$f":"IF(Tabelle_Auswertung[[#This Row],[Platz]]=3,CONCATENATE(Tabelle_Auswertung[[#This Row],[Bildname]],\" von \",Tabelle_Auswertung[[#This Row],[Autor(in)]]),\"\")","v":""},{"$f":"IF(Tabelle_Auswertung[[#This Row],[Platz]]=4,CONCATENATE(Tabelle_Auswertung[[#This Row],[Bildname]],\" von \",Tabelle_Auswertung[[#This Row],[Autor(in)]]),\"\")","v":""},{"$f":"IF(Tabelle_Auswertung[[#This Row],[Platz]]=5,CONCATENATE(Tabelle_Auswertung[[#This Row],[Bildname]],\" von \",Tabelle_Auswertung[[#This Row],[Autor(in)]]),\"\")","v":""},{"$f":"IF(Tabelle_Auswertung[[#This Row],[Platz]]=6,CONCATENATE(Tabelle_Auswertung[[#This Row],[Bildname]],\" von \",Tabelle_Auswertung[[#This Row],[Autor(in)]]),\"\")","v":""},{"$f":"IF(Tabelle_Auswertung[[#This Row],[Platz]]=7,CONCATENATE(Tabelle_Auswertung[[#This Row],[Bildname]],\" von \",Tabelle_Auswertung[[#This Row],[Autor(in)]]),\"\")","v":""},{"$f":"IF(Tabelle_Auswertung[[#This Row],[Platz]]=8,CONCATENATE(Tabelle_Auswertung[[#This Row],[Bildname]],\" von \",Tabelle_Auswertung[[#This Row],[Autor(in)]]),\"\")","v":""},{"$f":"IF(Tabelle_Auswertung[[#This Row],[Platz]]=9,CONCATENATE(Tabelle_Auswertung[[#This Row],[Bildname]],\" von \",Tabelle_Auswertung[[#This Row],[Autor(in)]]),\"\")","v":""},{"$f":"IF(Tabelle_Auswertung[[#This Row],[Platz]]=10,CONCATENATE(Tabelle_Auswertung[[#This Row],[Bildname]],\" von \",Tabelle_Auswertung[[#This Row],[Autor(in)]]),\"\")","v":""}]
[114,{"$nulls":21},{"$f":"IF(Tabelle_Auswertung[[#This Row],[Bildname]]<>\"\",\n    IF(Tabelle_Auswertung[[#This Row],[abwesend]]=\"ja\",\n        SUM(Tabelle_Auswertung[[#This Row],[Juror 1]:[Juror 20]])/COUNT(Tabelle_Auswertung[[#This Row],[Juror 1]:[Juror 20]])*(COUNT(Tabelle_Auswertung[[#This Row],[Juror 1]:[Juror 20]])-1),\n        SUM(Tabelle_Auswertung[[#This Row],[Juror 1]:[Juror 20]])\n    ),\n\" - \")","v":" - "},{"$f":"IF(Tabelle_Auswertung[[#This Row],[Bildname]]<>\"\",IF(Tabelle_Auswertung[[#This Row],[Punkte]]>0,AVERAGE(Tabelle_Auswertung[[#This Row],[Juror 1]:[Juror 20]]),\" - \"),\" - \")","v":" - "},{"$f":"IF(Tabelle_Auswertung[[#This Row],[Bildname]]<>\"\",IF(Tabelle_Auswertung[[#This Row],[Punkte]]>0,RANK(Tabelle_Auswertung[[#This Row],[Punkte]],[Punkte],0),\" - \"),\" - \")","v":" - "}," - - -",null,{"$f":"IF(Tabelle_Auswertung[[#This Row],[Platz]]=1,CONCATENATE(Tabelle_Auswertung[[#This Row],[Bildname]],\" von \",Tabelle_Auswertung[[#This Row],[Autor(in)]]),\"\")","v":""},{"$f":"IF(Tabelle_Auswertung[[#This Row],[Platz]]=2,CONCATENATE(Tabelle_Auswertung[[#This Row],[Bildname]],\" von \",Tabelle_Auswertung[[#This Row],[Autor(in)]]),\"\")","v":""},{"$f":"IF(Tabelle_Auswertung[[#This Row],[Platz]]=3,CONCATENATE(Tabelle_Auswertung[[#This Row],[Bildname]],\" von \",Tabelle_Auswertung[[#This Row],[Autor(in)]]),\"\")","v":""},{"$f":"IF(Tabelle_Auswertung[[#This Row],[Platz]]=4,CONCATENATE(Tabelle_Auswertung[[#This Row],[Bildname]],\" von \",Tabelle_Auswertung[[#This Row],[Autor(in)]]),\"\")","v":""},{"$f":"IF(Tabelle_Auswertung[[#This Row],[Platz]]=5,CONCATENATE(Tabelle_Auswertung[[#This Row],[Bildname]],\" von \",Tabelle_Auswertung[[#This Row],[Autor(in)]]),\"\")","v":""},{"$f":"IF(Tabelle_Auswertung[[#This Row],[Platz]]=6,CONCATENATE(Tabelle_Auswertung[[#This Row],[Bildname]],\" von \",Tabelle_Auswertung[[#This Row],[Autor(in)]]),\"\")","v":""},{"$f":"IF(Tabelle_Auswertung[[#This Row],[Platz]]=7,CONCATENATE(Tabelle_Auswertung[[#This Row],[Bildname]],\" von \",Tabelle_Auswertung[[#This Row],[Autor(in)]]),\"\")","v":""},{"$f":"IF(Tabelle_Auswertung[[#This Row],[Platz]]=8,CONCATENATE(Tabelle_Auswertung[[#This Row],[Bildname]],\" von \",Tabelle_Auswertung[[#This Row],[Autor(in)]]),\"\")","v":""},{"$f":"IF(Tabelle_Auswertung[[#This Row],[Platz]]=9,CONCATENATE(Tabelle_Auswertung[[#This Row],[Bildname]],\" von \",Tabelle_Auswertung[[#This Row],[Autor(in)]]),\"\")","v":""},{"$f":"IF(Tabelle_Auswertung[[#This Row],[Platz]]=10,CONCATENATE(Tabelle_Auswertung[[#This Row],[Bildname]],\" von \",Tabelle_Auswertung[[#This Row],[Autor(in)]]),\"\")","v":""}]
[115,{"$nulls":21},{"$f":"IF(Tabelle_Auswertung[[#This Row],[Bildname]]<>\"\",\n    IF(Tabelle_Auswertung[[#This Row],[abwesend]]=\"ja\",\n        SUM(Tabelle_Auswertung[[#This Row],[Juror 1]:[Juror 20]])/COUNT(Tabelle_Auswertung[[#This Row],[Juror 1]:[Juror 20]])*(COUNT(Tabelle_Auswertung[[#This Row],[Juror 1]:[Juror 20]])-1),\n        SUM(Tabelle_Auswertung[[#This Row],[Juror 1]:[Juror 20]])\n    ),\n\" - \")","v":" - "},{"$f":"IF(Tabelle_Auswertung[[#This Row],[Bildname]]<>\"\",IF(Tabelle_Auswertung[[#This Row],[Punkte]]>0,AVERAGE(Tabelle_Auswertung[[#This Row],[Juror 1]:[Juror 20]]),\" - \"),\" - \")","v":" - "},{"$f":"IF(Tabelle_Auswertung[[#This Row],[Bildname]]<>\"\",IF(Tabelle_Auswertung[[#This Row],[Punkte]]>0,RANK(Tabelle_Auswertung[[#This Row],[Punkte]],[Punkte],0),\" - \"),\" - \")","v":" - "}," - - -",null,{"$f":"IF(Tabelle_Auswertung[[#This Row],[Platz]]=1,CONCATENATE(Tabelle_Auswertung[[#This Row],[Bildname]],\" von \",Tabelle_Auswertung[[#This Row],[Autor(in)]]),\"\")","v":""},{"$f":"IF(Tabelle_Auswertung[[#This Row],[Platz]]=2,CONCATENATE(Tabelle_Auswertung[[#This Row],[Bildname]],\" von \",Tabelle_Auswertung[[#This Row],[Autor(in)]]),\"\")","v":""},{"$f":"IF(Tabelle_Auswertung[[#This Row],[Platz]]=3,CONCATENATE(Tabelle_Auswertung[[#This Row],[Bildname]],\" von \",Tabelle_Auswertung[[#This Row],[Autor(in)]]),\"\")","v":""},{"$f":"IF(Tabelle_Auswertung[[#This Row],[Platz]]=4,CONCATENATE(Tabelle_Auswertung[[#This Row],[Bildname]],\" von \",Tabelle_Auswertung[[#This Row],[Autor(in)]]),\"\")","v":""},{"$f":"IF(Tabelle_Auswertung[[#This Row],[Platz]]=5,CONCATENATE(Tabelle_Auswertung[[#This Row],[Bildname]],\" von \",Tabelle_Auswertung[[#This Row],[Autor(in)]]),\"\")","v":""},{"$f":"IF(Tabelle_Auswertung[[#This Row],[Platz]]=6,CONCATENATE(Tabelle_Auswertung[[#This Row],[Bildname]],\" von \",Tabelle_Auswertung[[#This Row],[Autor(in)]]),\"\")","v":""},{"$f":"IF(Tabelle_Auswertung[[#This Row],[Platz]]=7,CONCATENATE(Tabelle_Auswertung[[#This Row],[Bildname]],\" von \",Tabelle_Auswertung[[#This Row],[Autor(in)]]),\"\")","v":""},{"$f":"IF(Tabelle_Auswertung[[#This Row],[Platz]]=8,CONCATENATE(Tabelle_Auswertung[[#This Row],[Bildname]],\" von \",Tabelle_Auswertung[[#This Row],[Autor(in)]]),\"\")","v":""},{"$f":"IF(Tabelle_Auswertung[[#This Row],[Platz]]=9,CONCATENATE(Tabelle_Auswertung[[#This Row],[Bildname]],\" von \",Tabelle_Auswertung[[#This Row],[Autor(in)]]),\"\")","v":""},{"$f":"IF(Tabelle_Auswertung[[#This Row],[Platz]]=10,CONCATENATE(Tabelle_Auswertung[[#This Row],[Bildname]],\" von \",Tabelle_Auswertung[[#This Row],[Autor(in)]]),\"\")","v":""}]
[116,{"$nulls":21},{"$f":"IF(Tabelle_Auswertung[[#This Row],[Bildname]]<>\"\",\n    IF(Tabelle_Auswertung[[#This Row],[abwesend]]=\"ja\",\n        SUM(Tabelle_Auswertung[[#This Row],[Juror 1]:[Juror 20]])/COUNT(Tabelle_Auswertung[[#This Row],[Juror 1]:[Juror 20]])*(COUNT(Tabelle_Auswertung[[#This Row],[Juror 1]:[Juror 20]])-1),\n        SUM(Tabelle_Auswertung[[#This Row],[Juror 1]:[Juror 20]])\n    ),\n\" - \")","v":" - "},{"$f":"IF(Tabelle_Auswertung[[#This Row],[Bildname]]<>\"\",IF(Tabelle_Auswertung[[#This Row],[Punkte]]>0,AVERAGE(Tabelle_Auswertung[[#This Row],[Juror 1]:[Juror 20]]),\" - \"),\" - \")","v":" - "},{"$f":"IF(Tabelle_Auswertung[[#This Row],[Bildname]]<>\"\",IF(Tabelle_Auswertung[[#This Row],[Punkte]]>0,RANK(Tabelle_Auswertung[[#This Row],[Punkte]],[Punkte],0),\" - \"),\" - \")","v":" - "}," - - -",null,{"$f":"IF(Tabelle_Auswertung[[#This Row],[Platz]]=1,CONCATENATE(Tabelle_Auswertung[[#This Row],[Bildname]],\" von \",Tabelle_Auswertung[[#This Row],[Autor(in)]]),\"\")","v":""},{"$f":"IF(Tabelle_Auswertung[[#This Row],[Platz]]=2,CONCATENATE(Tabelle_Auswertung[[#This Row],[Bildname]],\" von \",Tabelle_Auswertung[[#This Row],[Autor(in)]]),\"\")","v":""},{"$f":"IF(Tabelle_Auswertung[[#This Row],[Platz]]=3,CONCATENATE(Tabelle_Auswertung[[#This Row],[Bildname]],\" von \",Tabelle_Auswertung[[#This Row],[Autor(in)]]),\"\")","v":""},{"$f":"IF(Tabelle_Auswertung[[#This Row],[Platz]]=4,CONCATENATE(Tabelle_Auswertung[[#This Row],[Bildname]],\" von \",Tabelle_Auswertung[[#This Row],[Autor(in)]]),\"\")","v":""},{"$f":"IF(Tabelle_Auswertung[[#This Row],[Platz]]=5,CONCATENATE(Tabelle_Auswertung[[#This Row],[Bildname]],\" von \",Tabelle_Auswertung[[#This Row],[Autor(in)]]),\"\")","v":""},{"$f":"IF(Tabelle_Auswertung[[#This Row],[Platz]]=6,CONCATENATE(Tabelle_Auswertung[[#This Row],[Bildname]],\" von \",Tabelle_Auswertung[[#This Row],[Autor(in)]]),\"\")","v":""},{"$f":"IF(Tabelle_Auswertung[[#This Row],[Platz]]=7,CONCATENATE(Tabelle_Auswertung[[#This Row],[Bildname]],\" von \",Tabelle_Auswertung[[#This Row],[Autor(in)]]),\"\")","v":""},{"$f":"IF(Tabelle_Auswertung[[#This Row],[Platz]]=8,CONCATENATE(Tabelle_Auswertung[[#This Row],[Bildname]],\" von \",Tabelle_Auswertung[[#This Row],[Autor(in)]]),\"\")","v":""},{"$f":"IF(Tabelle_Auswertung[[#This Row],[Platz]]=9,CONCATENATE(Tabelle_Auswertung[[#This Row],[Bildname]],\" von \",Tabelle_Auswertung[[#This Row],[Autor(in)]]),\"\")","v":""},{"$f":"IF(Tabelle_Auswertung[[#This Row],[Platz]]=10,CONCATENATE(Tabelle_Auswertung[[#This Row],[Bildname]],\" von \",Tabelle_Auswertung[[#This Row],[Autor(in)]]),\"\")","v":""}]
[117,{"$nulls":21},{"$f":"IF(Tabelle_Auswertung[[#This Row],[Bildname]]<>\"\",\n    IF(Tabelle_Auswertung[[#This Row],[abwesend]]=\"ja\",\n        SUM(Tabelle_Auswertung[[#This Row],[Juror 1]:[Juror 20]])/COUNT(Tabelle_Auswertung[[#This Row],[Juror 1]:[Juror 20]])*(COUNT(Tabelle_Auswertung[[#This Row],[Juror 1]:[Juror 20]])-1),\n        SUM(Tabelle_Auswertung[[#This Row],[Juror 1]:[Juror 20]])\n    ),\n\" - \")","v":" - "},{"$f":"IF(Tabelle_Auswertung[[#This Row],[Bildname]]<>\"\",IF(Tabelle_Auswertung[[#This Row],[Punkte]]>0,AVERAGE(Tabelle_Auswertung[[#This Row],[Juror 1]:[Juror 20]]),\" - \"),\" - \")","v":" - "},{"$f":"IF(Tabelle_Auswertung[[#This Row],[Bildname]]<>\"\",IF(Tabelle_Auswertung[[#This Row],[Punkte]]>0,RANK(Tabelle_Auswertung[[#This Row],[Punkte]],[Punkte],0),\" - \"),\" - \")","v":" - "}," - - -",null,{"$f":"IF(Tabelle_Auswertung[[#This Row],[Platz]]=1,CONCATENATE(Tabelle_Auswertung[[#This Row],[Bildname]],\" von \",Tabelle_Auswertung[[#This Row],[Autor(in)]]),\"\")","v":""},{"$f":"IF(Tabelle_Auswertung[[#This Row],[Platz]]=2,CONCATENATE(Tabelle_Auswertung[[#This Row],[Bildname]],\" von \",Tabelle_Auswertung[[#This Row],[Autor(in)]]),\"\")","v":""},{"$f":"IF(Tabelle_Auswertung[[#This Row],[Platz]]=3,CONCATENATE(Tabelle_Auswertung[[#This Row],[Bildname]],\" von \",Tabelle_Auswertung[[#This Row],[Autor(in)]]),\"\")","v":""},{"$f":"IF(Tabelle_Auswertung[[#This Row],[Platz]]=4,CONCATENATE(Tabelle_Auswertung[[#This Row],[Bildname]],\" von \",Tabelle_Auswertung[[#This Row],[Autor(in)]]),\"\")","v":""},{"$f":"IF(Tabelle_Auswertung[[#This Row],[Platz]]=5,CONCATENATE(Tabelle_Auswertung[[#This Row],[Bildname]],\" von \",Tabelle_Auswertung[[#This Row],[Autor(in)]]),\"\")","v":""},{"$f":"IF(Tabelle_Auswertung[[#This Row],[Platz]]=6,CONCATENATE(Tabelle_Auswertung[[#This Row],[Bildname]],\" von \",Tabelle_Auswertung[[#This Row],[Autor(in)]]),\"\")","v":""},{"$f":"IF(Tabelle_Auswertung[[#This Row],[Platz]]=7,CONCATENATE(Tabelle_Auswertung[[#This Row],[Bildname]],\" von \",Tabelle_Auswertung[[#This Row],[Autor(in)]]),\"\")","v":""},{"$f":"IF(Tabelle_Auswertung[[#This Row],[Platz]]=8,CONCATENATE(Tabelle_Auswertung[[#This Row],[Bildname]],\" von \",Tabelle_Auswertung[[#This Row],[Autor(in)]]),\"\")","v":""},{"$f":"IF(Tabelle_Auswertung[[#This Row],[Platz]]=9,CONCATENATE(Tabelle_Auswertung[[#This Row],[Bildname]],\" von \",Tabelle_Auswertung[[#This Row],[Autor(in)]]),\"\")","v":""},{"$f":"IF(Tabelle_Auswertung[[#This Row],[Platz]]=10,CONCATENATE(Tabelle_Auswertung[[#This Row],[Bildname]],\" von \",Tabelle_Auswertung[[#This Row],[Autor(in)]]),\"\")","v":""}]
[118,{"$nulls":21},{"$f":"IF(Tabelle_Auswertung[[#This Row],[Bildname]]<>\"\",\n    IF(Tabelle_Auswertung[[#This Row],[abwesend]]=\"ja\",\n        SUM(Tabelle_Auswertung[[#This Row],[Juror 1]:[Juror 20]])/COUNT(Tabelle_Auswertung[[#This Row],[Juror 1]:[Juror 20]])*(COUNT(Tabelle_Auswertung[[#This Row],[Juror 1]:[Juror 20]])-1),\n        SUM(Tabelle_Auswertung[[#This Row],[Juror 1]:[Juror 20]])\n    ),\n\" - \")","v":" - "},{"$f":"IF(Tabelle_Auswertung[[#This Row],[Bildname]]<>\"\",IF(Tabelle_Auswertung[[#This Row],[Punkte]]>0,AVERAGE(Tabelle_Auswertung[[#This Row],[Juror 1]:[Juror 20]]),\" - \"),\" - \")","v":" - "},{"$f":"IF(Tabelle_Auswertung[[#This Row],[Bildname]]<>\"\",IF(Tabelle_Auswertung[[#This Row],[Punkte]]>0,RANK(Tabelle_Auswertung[[#This Row],[Punkte]],[Punkte],0),\" - \"),\" - \")","v":" - "}," - - -",null,{"$f":"IF(Tabelle_Auswertung[[#This Row],[Platz]]=1,CONCATENATE(Tabelle_Auswertung[[#This Row],[Bildname]],\" von \",Tabelle_Auswertung[[#This Row],[Autor(in)]]),\"\")","v":""},{"$f":"IF(Tabelle_Auswertung[[#This Row],[Platz]]=2,CONCATENATE(Tabelle_Auswertung[[#This Row],[Bildname]],\" von \",Tabelle_Auswertung[[#This Row],[Autor(in)]]),\"\")","v":""},{"$f":"IF(Tabelle_Auswertung[[#This Row],[Platz]]=3,CONCATENATE(Tabelle_Auswertung[[#This Row],[Bildname]],\" von \",Tabelle_Auswertung[[#This Row],[Autor(in)]]),\"\")","v":""},{"$f":"IF(Tabelle_Auswertung[[#This Row],[Platz]]=4,CONCATENATE(Tabelle_Auswertung[[#This Row],[Bildname]],\" von \",Tabelle_Auswertung[[#This Row],[Autor(in)]]),\"\")","v":""},{"$f":"IF(Tabelle_Auswertung[[#This Row],[Platz]]=5,CONCATENATE(Tabelle_Auswertung[[#This Row],[Bildname]],\" von \",Tabelle_Auswertung[[#This Row],[Autor(in)]]),\"\")","v":""},{"$f":"IF(Tabelle_Auswertung[[#This Row],[Platz]]=6,CONCATENATE(Tabelle_Auswertung[[#This Row],[Bildname]],\" von \",Tabelle_Auswertung[[#This Row],[Autor(in)]]),\"\")","v":""},{"$f":"IF(Tabelle_Auswertung[[#This Row],[Platz]]=7,CONCATENATE(Tabelle_Auswertung[[#This Row],[Bildname]],\" von \",Tabelle_Auswertung[[#This Row],[Autor(in)]]),\"\")","v":""},{"$f":"IF(Tabelle_Auswertung[[#This Row],[Platz]]=8,CONCATENATE(Tabelle_Auswertung[[#This Row],[Bildname]],\" von \",Tabelle_Auswertung[[#This Row],[Autor(in)]]),\"\")","v":""},{"$f":"IF(Tabelle_Auswertung[[#This Row],[Platz]]=9,CONCATENATE(Tabelle_Auswertung[[#This Row],[Bildname]],\" von \",Tabelle_Auswertung[[#This Row],[Autor(in)]]),\"\")","v":""},{"$f":"IF(Tabelle_Auswertung[[#This Row],[Platz]]=10,CONCATENATE(Tabelle_Auswertung[[#This Row],[Bildname]],\" von \",Tabelle_Auswertung[[#This Row],[Autor(in)]]),\"\")","v":""}]
[119,{"$nulls":21},{"$f":"IF(Tabelle_Auswertung[[#This Row],[Bildname]]<>\"\",\n    IF(Tabelle_Auswertung[[#This Row],[abwesend]]=\"ja\",\n        SUM(Tabelle_Auswertung[[#This Row],[Juror 1]:[Juror 20]])/COUNT(Tabelle_Auswertung[[#This Row],[Juror 1]:[Juror 20]])*(COUNT(Tabelle_Auswertung[[#This Row],[Juror 1]:[Juror 20]])-1),\n        SUM(Tabelle_Auswertung[[#This Row],[Juror 1]:[Juror 20]])\n    ),\n\" - \")","v":" - "},{"$f":"IF(Tabelle_Auswertung[[#This Row],[Bildname]]<>\"\",IF(Tabelle_Auswertung[[#This Row],[Punkte]]>0,AVERAGE(Tabelle_Auswertung[[#This Row],[Juror 1]:[Juror 20]]),\" - \"),\" - \")","v":" - "},{"$f":"IF(Tabelle_Auswertung[[#This Row],[Bildname]]<>\"\",IF(Tabelle_Auswertung[[#This Row],[Punkte]]>0,RANK(Tabelle_Auswertung[[#This Row],[Punkte]],[Punkte],0),\" - \"),\" - \")","v":" - "}," - - -",null,{"$f":"IF(Tabelle_Auswertung[[#This Row],[Platz]]=1,CONCATENATE(Tabelle_Auswertung[[#This Row],[Bildname]],\" von \",Tabelle_Auswertung[[#This Row],[Autor(in)]]),\"\")","v":""},{"$f":"IF(Tabelle_Auswertung[[#This Row],[Platz]]=2,CONCATENATE(Tabelle_Auswertung[[#This Row],[Bildname]],\" von \",Tabelle_Auswertung[[#This Row],[Autor(in)]]),\"\")","v":""},{"$f":"IF(Tabelle_Auswertung[[#This Row],[Platz]]=3,CONCATENATE(Tabelle_Auswertung[[#This Row],[Bildname]],\" von \",Tabelle_Auswertung[[#This Row],[Autor(in)]]),\"\")","v":""},{"$f":"IF(Tabelle_Auswertung[[#This Row],[Platz]]=4,CONCATENATE(Tabelle_Auswertung[[#This Row],[Bildname]],\" von \",Tabelle_Auswertung[[#This Row],[Autor(in)]]),\"\")","v":""},{"$f":"IF(Tabelle_Auswertung[[#This Row],[Platz]]=5,CONCATENATE(Tabelle_Auswertung[[#This Row],[Bildname]],\" von \",Tabelle_Auswertung[[#This Row],[Autor(in)]]),\"\")","v":""},{"$f":"IF(Tabelle_Auswertung[[#This Row],[Platz]]=6,CONCATENATE(Tabelle_Auswertung[[#This Row],[Bildname]],\" von \",Tabelle_Auswertung[[#This Row],[Autor(in)]]),\"\")","v":""},{"$f":"IF(Tabelle_Auswertung[[#This Row],[Platz]]=7,CONCATENATE(Tabelle_Auswertung[[#This Row],[Bildname]],\" von \",Tabelle_Auswertung[[#This Row],[Autor(in)]]),\"\")","v":""},{"$f":"IF(Tabelle_Auswertung[[#This Row],[Platz]]=8,CONCATENATE(Tabelle_Auswertung[[#This Row],[Bildname]],\" von \",Tabelle_Auswertung[[#This Row],[Autor(in)]]),\"\")","v":""},{"$f":"IF(Tabelle_Auswertung[[#This Row],[Platz]]=9,CONCATENATE(Tabelle_Auswertung[[#This Row],[Bildname]],\" von \",Tabelle_Auswertung[[#This Row],[Autor(in)]]),\"\")","v":""},{"$f":"IF(Tabelle_Auswertung[[#This Row],[Platz]]=10,CONCATENATE(Tabelle_Auswertung[[#This Row],[Bildname]],\" von \",Tabelle_Auswertung[[#This Row],[Autor(in)]]),\"\")","v":""}]
[120,{"$nulls":21},{"$f":"IF(Tabelle_Auswertung[[#This Row],[Bildname]]<>\"\",\n    IF(Tabelle_Auswertung[[#This Row],[abwesend]]=\"ja\",\n        SUM(Tabelle_Auswertung[[#This Row],[Juror 1]:[Juror 20]])/COUNT(Tabelle_Auswertung[[#This Row],[Juror 1]:[Juror 20]])*(COUNT(Tabelle_Auswertung[[#This Row],[Juror 1]:[Juror 20]])-1),\n        SUM(Tabelle_Auswertung[[#This Row],[Juror 1]:[Juror 20]])\n    ),\n\" - \")","v":" - "},{"$f":"IF(Tabelle_Auswertung[[#This Row],[Bildname]]<>\"\",IF(Tabelle_Auswertung[[#This Row],[Punkte]]>0,AVERAGE(Tabelle_Auswertung[[#This Row],[Juror 1]:[Juror 20]]),\" - \"),\" - \")","v":" - "},{"$f":"IF(Tabelle_Auswertung[[#This Row],[Bildname]]<>\"\",IF(Tabelle_Auswertung[[#This Row],[Punkte]]>0,RANK(Tabelle_Auswertung[[#This Row],[Punkte]],[Punkte],0),\" - \"),\" - \")","v":" - "}," - - -",null,{"$f":"IF(Tabelle_Auswertung[[#This Row],[Platz]]=1,CONCATENATE(Tabelle_Auswertung[[#This Row],[Bildname]],\" von \",Tabelle_Auswertung[[#This Row],[Autor(in)]]),\"\")","v":""},{"$f":"IF(Tabelle_Auswertung[[#This Row],[Platz]]=2,CONCATENATE(Tabelle_Auswertung[[#This Row],[Bildname]],\" von \",Tabelle_Auswertung[[#This Row],[Autor(in)]]),\"\")","v":""},{"$f":"IF(Tabelle_Auswertung[[#This Row],[Platz]]=3,CONCATENATE(Tabelle_Auswertung[[#This Row],[Bildname]],\" von \",Tabelle_Auswertung[[#This Row],[Autor(in)]]),\"\")","v":""},{"$f":"IF(Tabelle_Auswertung[[#This Row],[Platz]]=4,CONCATENATE(Tabelle_Auswertung[[#This Row],[Bildname]],\" von \",Tabelle_Auswertung[[#This Row],[Autor(in)]]),\"\")","v":""},{"$f":"IF(Tabelle_Auswertung[[#This Row],[Platz]]=5,CONCATENATE(Tabelle_Auswertung[[#This Row],[Bildname]],\" von \",Tabelle_Auswertung[[#This Row],[Autor(in)]]),\"\")","v":""},{"$f":"IF(Tabelle_Auswertung[[#This Row],[Platz]]=6,CONCATENATE(Tabelle_Auswertung[[#This Row],[Bildname]],\" von \",Tabelle_Auswertung[[#This Row],[Autor(in)]]),\"\")","v":""},{"$f":"IF(Tabelle_Auswertung[[#This Row],[Platz]]=7,CONCATENATE(Tabelle_Auswertung[[#This Row],[Bildname]],\" von \",Tabelle_Auswertung[[#This Row],[Autor(in)]]),\"\")","v":""},{"$f":"IF(Tabelle_Auswertung[[#This Row],[Platz]]=8,CONCATENATE(Tabelle_Auswertung[[#This Row],[Bildname]],\" von \",Tabelle_Auswertung[[#This Row],[Autor(in)]]),\"\")","v":""},{"$f":"IF(Tabelle_Auswertung[[#This Row],[Platz]]=9,CONCATENATE(Tabelle_Auswertung[[#This Row],[Bildname]],\" von \",Tabelle_Auswertung[[#This Row],[Autor(in)]]),\"\")","v":""},{"$f":"IF(Tabelle_Auswertung[[#This Row],[Platz]]=10,CONCATENATE(Tabelle_Auswertung[[#This Row],[Bildname]],\" von \",Tabelle_Auswertung[[#This Row],[Autor(in)]]),\"\")","v":""}]
[121,{"$nulls":21},{"$f":"IF(Tabelle_Auswertung[[#This Row],[Bildname]]<>\"\",\n    IF(Tabelle_Auswertung[[#This Row],[abwesend]]=\"ja\",\n        SUM(Tabelle_Auswertung[[#This Row],[Juror 1]:[Juror 20]])/COUNT(Tabelle_Auswertung[[#This Row],[Juror 1]:[Juror 20]])*(COUNT(Tabelle_Auswertung[[#This Row],[Juror 1]:[Juror 20]])-1),\n        SUM(Tabelle_Auswertung[[#This Row],[Juror 1]:[Juror 20]])\n    ),\n\" - \")","v":" - "},{"$f":"IF(Tabelle_Auswertung[[#This Row],[Bildname]]<>\"\",IF(Tabelle_Auswertung[[#This Row],[Punkte]]>0,AVERAGE(Tabelle_Auswertung[[#This Row],[Juror 1]:[Juror 20]]),\" - \"),\" - \")","v":" - "},{"$f":"IF(Tabelle_Auswertung[[#This Row],[Bildname]]<>\"\",IF(Tabelle_Auswertung[[#This Row],[Punkte]]>0,RANK(Tabelle_Auswertung[[#This Row],[Punkte]],[Punkte],0),\" - \"),\" - \")","v":" - "}," - - -",null,{"$f":"IF(Tabelle_Auswertung[[#This Row],[Platz]]=1,CONCATENATE(Tabelle_Auswertung[[#This Row],[Bildname]],\" von \",Tabelle_Auswertung[[#This Row],[Autor(in)]]),\"\")","v":""},{"$f":"IF(Tabelle_Auswertung[[#This Row],[Platz]]=2,CONCATENATE(Tabelle_Auswertung[[#This Row],[Bildname]],\" von \",Tabelle_Auswertung[[#This Row],[Autor(in)]]),\"\")","v":""},{"$f":"IF(Tabelle_Auswertung[[#This Row],[Platz]]=3,CONCATENATE(Tabelle_Auswertung[[#This Row],[Bildname]],\" von \",Tabelle_Auswertung[[#This Row],[Autor(in)]]),\"\")","v":""},{"$f":"IF(Tabelle_Auswertung[[#This Row],[Platz]]=4,CONCATENATE(Tabelle_Auswertung[[#This Row],[Bildname]],\" von \",Tabelle_Auswertung[[#This Row],[Autor(in)]]),\"\")","v":""},{"$f":"IF(Tabelle_Auswertung[[#This Row],[Platz]]=5,CONCATENATE(Tabelle_Auswertung[[#This Row],[Bildname]],\" von \",Tabelle_Auswertung[[#This Row],[Autor(in)]]),\"\")","v":""},{"$f":"IF(Tabelle_Auswertung[[#This Row],[Platz]]=6,CONCATENATE(Tabelle_Auswertung[[#This Row],[Bildname]],\" von \",Tabelle_Auswertung[[#This Row],[Autor(in)]]),\"\")","v":""},{"$f":"IF(Tabelle_Auswertung[[#This Row],[Platz]]=7,CONCATENATE(Tabelle_Auswertung[[#This Row],[Bildname]],\" von \",Tabelle_Auswertung[[#This Row],[Autor(in)]]),\"\")","v":""},{"$f":"IF(Tabelle_Auswertung[[#This Row],[Platz]]=8,CONCATENATE(Tabelle_Auswertung[[#This Row],[Bildname]],\" von \",Tabelle_Auswertung[[#This Row],[Autor(in)]]),\"\")","v":""},{"$f":"IF(Tabelle_Auswertung[[#This Row],[Platz]]=9,CONCATENATE(Tabelle_Auswertung[[#This Row],[Bildname]],\" von \",Tabelle_Auswertung[[#This Row],[Autor(in)]]),\"\")","v":""},{"$f":"IF(Tabelle_Auswertung[[#This Row],[Platz]]=10,CONCATENATE(Tabelle_Auswertung[[#This Row],[Bildname]],\" von \",Tabelle_Auswertung[[#This Row],[Autor(in)]]),\"\")","v":""}]
[122,{"$nulls":21},{"$f":"IF(Tabelle_Auswertung[[#This Row],[Bildname]]<>\"\",\n    IF(Tabelle_Auswertung[[#This Row],[abwesend]]=\"ja\",\n        SUM(Tabelle_Auswertung[[#This Row],[Juror 1]:[Juror 20]])/COUNT(Tabelle_Auswertung[[#This Row],[Juror 1]:[Juror 20]])*(COUNT(Tabelle_Auswertung[[#This Row],[Juror 1]:[Juror 20]])-1),\n        SUM(Tabelle_Auswertung[[#This Row],[Juror 1]:[Juror 20]])\n    ),\n\" - \")","v":" - "},{"$f":"IF(Tabelle_Auswertung[[#This Row],[Bildname]]<>\"\",IF(Tabelle_Auswertung[[#This Row],[Punkte]]>0,AVERAGE(Tabelle_Auswertung[[#This Row],[Juror 1]:[Juror 20]]),\" - \"),\" - \")","v":" - "},{"$f":"IF(Tabelle_Auswertung[[#This Row],[Bildname]]<>\"\",IF(Tabelle_Auswertung[[#This Row],[Punkte]]>0,RANK(Tabelle_Auswertung[[#This Row],[Punkte]],[Punkte],0),\" - \"),\" - \")","v":" - "}," - - -",null,{"$f":"IF(Tabelle_Auswertung[[#This Row],[Platz]]=1,CONCATENATE(Tabelle_Auswertung[[#This Row],[Bildname]],\" von \",Tabelle_Auswertung[[#This Row],[Autor(in)]]),\"\")","v":""},{"$f":"IF(Tabelle_Auswertung[[#This Row],[Platz]]=2,CONCATENATE(Tabelle_Auswertung[[#This Row],[Bildname]],\" von \",Tabelle_Auswertung[[#This Row],[Autor(in)]]),\"\")","v":""},{"$f":"IF(Tabelle_Auswertung[[#This Row],[Platz]]=3,CONCATENATE(Tabelle_Auswertung[[#This Row],[Bildname]],\" von \",Tabelle_Auswertung[[#This Row],[Autor(in)]]),\"\")","v":""},{"$f":"IF(Tabelle_Auswertung[[#This Row],[Platz]]=4,CONCATENATE(Tabelle_Auswertung[[#This Row],[Bildname]],\" von \",Tabelle_Auswertung[[#This Row],[Autor(in)]]),\"\")","v":""},{"$f":"IF(Tabelle_Auswertung[[#This Row],[Platz]]=5,CONCATENATE(Tabelle_Auswertung[[#This Row],[Bildname]],\" von \",Tabelle_Auswertung[[#This Row],[Autor(in)]]),\"\")","v":""},{"$f":"IF(Tabelle_Auswertung[[#This Row],[Platz]]=6,CONCATENATE(Tabelle_Auswertung[[#This Row],[Bildname]],\" von \",Tabelle_Auswertung[[#This Row],[Autor(in)]]),\"\")","v":""},{"$f":"IF(Tabelle_Auswertung[[#This Row],[Platz]]=7,CONCATENATE(Tabelle_Auswertung[[#This Row],[Bildname]],\" von \",Tabelle_Auswertung[[#This Row],[Autor(in)]]),\"\")","v":""},{"$f":"IF(Tabelle_Auswertung[[#This Row],[Platz]]=8,CONCATENATE(Tabelle_Auswertung[[#This Row],[Bildname]],\" von \",Tabelle_Auswertung[[#This Row],[Autor(in)]]),\"\")","v":""},{"$f":"IF(Tabelle_Auswertung[[#This Row],[Platz]]=9,CONCATENATE(Tabelle_Auswertung[[#This Row],[Bildname]],\" von \",Tabelle_Auswertung[[#This Row],[Autor(in)]]),\"\")","v":""},{"$f":"IF(Tabelle_Auswertung[[#This Row],[Platz]]=10,CONCATENATE(Tabelle_Auswertung[[#This Row],[Bildname]],\" von \",Tabelle_Auswertung[[#This Row],[Autor(in)]]),\"\")","v":""}]
[123,{"$nulls":21},{"$f":"IF(Tabelle_Auswertung[[#This Row],[Bildname]]<>\"\",\n    IF(Tabelle_Auswertung[[#This Row],[abwesend]]=\"ja\",\n        SUM(Tabelle_Auswertung[[#This Row],[Juror 1]:[Juror 20]])/COUNT(Tabelle_Auswertung[[#This Row],[Juror 1]:[Juror 20]])*(COUNT(Tabelle_Auswertung[[#This Row],[Juror 1]:[Juror 20]])-1),\n        SUM(Tabelle_Auswertung[[#This Row],[Juror 1]:[Juror 20]])\n    ),\n\" - \")","v":" - "},{"$f":"IF(Tabelle_Auswertung[[#This Row],[Bildname]]<>\"\",IF(Tabelle_Auswertung[[#This Row],[Punkte]]>0,AVERAGE(Tabelle_Auswertung[[#This Row],[Juror 1]:[Juror 20]]),\" - \"),\" - \")","v":" - "},{"$f":"IF(Tabelle_Auswertung[[#This Row],[Bildname]]<>\"\",IF(Tabelle_Auswertung[[#This Row],[Punkte]]>0,RANK(Tabelle_Auswertung[[#This Row],[Punkte]],[Punkte],0),\" - \"),\" - \")","v":" - "}," - - -",null,{"$f":"IF(Tabelle_Auswertung[[#This Row],[Platz]]=1,CONCATENATE(Tabelle_Auswertung[[#This Row],[Bildname]],\" von \",Tabelle_Auswertung[[#This Row],[Autor(in)]]),\"\")","v":""},{"$f":"IF(Tabelle_Auswertung[[#This Row],[Platz]]=2,CONCATENATE(Tabelle_Auswertung[[#This Row],[Bildname]],\" von \",Tabelle_Auswertung[[#This Row],[Autor(in)]]),\"\")","v":""},{"$f":"IF(Tabelle_Auswertung[[#This Row],[Platz]]=3,CONCATENATE(Tabelle_Auswertung[[#This Row],[Bildname]],\" von \",Tabelle_Auswertung[[#This Row],[Autor(in)]]),\"\")","v":""},{"$f":"IF(Tabelle_Auswertung[[#This Row],[Platz]]=4,CONCATENATE(Tabelle_Auswertung[[#This Row],[Bildname]],\" von \",Tabelle_Auswertung[[#This Row],[Autor(in)]]),\"\")","v":""},{"$f":"IF(Tabelle_Auswertung[[#This Row],[Platz]]=5,CONCATENATE(Tabelle_Auswertung[[#This Row],[Bildname]],\" von \",Tabelle_Auswertung[[#This Row],[Autor(in)]]),\"\")","v":""},{"$f":"IF(Tabelle_Auswertung[[#This Row],[Platz]]=6,CONCATENATE(Tabelle_Auswertung[[#This Row],[Bildname]],\" von \",Tabelle_Auswertung[[#This Row],[Autor(in)]]),\"\")","v":""},{"$f":"IF(Tabelle_Auswertung[[#This Row],[Platz]]=7,CONCATENATE(Tabelle_Auswertung[[#This Row],[Bildname]],\" von \",Tabelle_Auswertung[[#This Row],[Autor(in)]]),\"\")","v":""},{"$f":"IF(Tabelle_Auswertung[[#This Row],[Platz]]=8,CONCATENATE(Tabelle_Auswertung[[#This Row],[Bildname]],\" von \",Tabelle_Auswertung[[#This Row],[Autor(in)]]),\"\")","v":""},{"$f":"IF(Tabelle_Auswertung[[#This Row],[Platz]]=9,CONCATENATE(Tabelle_Auswertung[[#This Row],[Bildname]],\" von \",Tabelle_Auswertung[[#This Row],[Autor(in)]]),\"\")","v":""},{"$f":"IF(Tabelle_Auswertung[[#This Row],[Platz]]=10,CONCATENATE(Tabelle_Auswertung[[#This Row],[Bildname]],\" von \",Tabelle_Auswertung[[#This Row],[Autor(in)]]),\"\")","v":""}]
[124,{"$nulls":21},{"$f":"IF(Tabelle_Auswertung[[#This Row],[Bildname]]<>\"\",\n    IF(Tabelle_Auswertung[[#This Row],[abwesend]]=\"ja\",\n        SUM(Tabelle_Auswertung[[#This Row],[Juror 1]:[Juror 20]])/COUNT(Tabelle_Auswertung[[#This Row],[Juror 1]:[Juror 20]])*(COUNT(Tabelle_Auswertung[[#This Row],[Juror 1]:[Juror 20]])-1),\n        SUM(Tabelle_Auswertung[[#This Row],[Juror 1]:[Juror 20]])\n    ),\n\" - \")","v":" - "},{"$f":"IF(Tabelle_Auswertung[[#This Row],[Bildname]]<>\"\",IF(Tabelle_Auswertung[[#This Row],[Punkte]]>0,AVERAGE(Tabelle_Auswertung[[#This Row],[Juror 1]:[Juror 20]]),\" - \"),\" - \")","v":" - "},{"$f":"IF(Tabelle_Auswertung[[#This Row],[Bildname]]<>\"\",IF(Tabelle_Auswertung[[#This Row],[Punkte]]>0,RANK(Tabelle_Auswertung[[#This Row],[Punkte]],[Punkte],0),\" - \"),\" - \")","v":" - "}," - - -",null,{"$f":"IF(Tabelle_Auswertung[[#This Row],[Platz]]=1,CONCATENATE(Tabelle_Auswertung[[#This Row],[Bildname]],\" von \",Tabelle_Auswertung[[#This Row],[Autor(in)]]),\"\")","v":""},{"$f":"IF(Tabelle_Auswertung[[#This Row],[Platz]]=2,CONCATENATE(Tabelle_Auswertung[[#This Row],[Bildname]],\" von \",Tabelle_Auswertung[[#This Row],[Autor(in)]]),\"\")","v":""},{"$f":"IF(Tabelle_Auswertung[[#This Row],[Platz]]=3,CONCATENATE(Tabelle_Auswertung[[#This Row],[Bildname]],\" von \",Tabelle_Auswertung[[#This Row],[Autor(in)]]),\"\")","v":""},{"$f":"IF(Tabelle_Auswertung[[#This Row],[Platz]]=4,CONCATENATE(Tabelle_Auswertung[[#This Row],[Bildname]],\" von \",Tabelle_Auswertung[[#This Row],[Autor(in)]]),\"\")","v":""},{"$f":"IF(Tabelle_Auswertung[[#This Row],[Platz]]=5,CONCATENATE(Tabelle_Auswertung[[#This Row],[Bildname]],\" von \",Tabelle_Auswertung[[#This Row],[Autor(in)]]),\"\")","v":""},{"$f":"IF(Tabelle_Auswertung[[#This Row],[Platz]]=6,CONCATENATE(Tabelle_Auswertung[[#This Row],[Bildname]],\" von \",Tabelle_Auswertung[[#This Row],[Autor(in)]]),\"\")","v":""},{"$f":"IF(Tabelle_Auswertung[[#This Row],[Platz]]=7,CONCATENATE(Tabelle_Auswertung[[#This Row],[Bildname]],\" von \",Tabelle_Auswertung[[#This Row],[Autor(in)]]),\"\")","v":""},{"$f":"IF(Tabelle_Auswertung[[#This Row],[Platz]]=8,CONCATENATE(Tabelle_Auswertung[[#This Row],[Bildname]],\" von \",Tabelle_Auswertung[[#This Row],[Autor(in)]]),\"\")","v":""},{"$f":"IF(Tabelle_Auswertung[[#This Row],[Platz]]=9,CONCATENATE(Tabelle_Auswertung[[#This Row],[Bildname]],\" von \",Tabelle_Auswertung[[#This Row],[Autor(in)]]),\"\")","v":""},{"$f":"IF(Tabelle_Auswertung[[#This Row],[Platz]]=10,CONCATENATE(Tabelle_Auswertung[[#This Row],[Bildname]],\" von \",Tabelle_Auswertung[[#This Row],[Autor(in)]]),\"\")","v":""}]
[125,{"$nulls":21},{"$f":"IF(Tabelle_Auswertung[[#This Row],[Bildname]]<>\"\",\n    IF(Tabelle_Auswertung[[#This Row],[abwesend]]=\"ja\",\n        SUM(Tabelle_Auswertung[[#This Row],[Juror 1]:[Juror 20]])/COUNT(Tabelle_Auswertung[[#This Row],[Juror 1]:[Juror 20]])*(COUNT(Tabelle_Auswertung[[#This Row],[Juror 1]:[Juror 20]])-1),\n        SUM(Tabelle_Auswertung[[#This Row],[Juror 1]:[Juror 20]])\n    ),\n\" - \")","v":" - "},{"$f":"IF(Tabelle_Auswertung[[#This Row],[Bildname]]<>\"\",IF(Tabelle_Auswertung[[#This Row],[Punkte]]>0,AVERAGE(Tabelle_Auswertung[[#This Row],[Juror 1]:[Juror 20]]),\" - \"),\" - \")","v":" - "},{"$f":"IF(Tabelle_Auswertung[[#This Row],[Bildname]]<>\"\",IF(Tabelle_Auswertung[[#This Row],[Punkte]]>0,RANK(Tabelle_Auswertung[[#This Row],[Punkte]],[Punkte],0),\" - \"),\" - \")","v":" - "}," - - -",null,{"$f":"IF(Tabelle_Auswertung[[#This Row],[Platz]]=1,CONCATENATE(Tabelle_Auswertung[[#This Row],[Bildname]],\" von \",Tabelle_Auswertung[[#This Row],[Autor(in)]]),\"\")","v":""},{"$f":"IF(Tabelle_Auswertung[[#This Row],[Platz]]=2,CONCATENATE(Tabelle_Auswertung[[#This Row],[Bildname]],\" von \",Tabelle_Auswertung[[#This Row],[Autor(in)]]),\"\")","v":""},{"$f":"IF(Tabelle_Auswertung[[#This Row],[Platz]]=3,CONCATENATE(Tabelle_Auswertung[[#This Row],[Bildname]],\" von \",Tabelle_Auswertung[[#This Row],[Autor(in)]]),\"\")","v":""},{"$f":"IF(Tabelle_Auswertung[[#This Row],[Platz]]=4,CONCATENATE(Tabelle_Auswertung[[#This Row],[Bildname]],\" von \",Tabelle_Auswertung[[#This Row],[Autor(in)]]),\"\")","v":""},{"$f":"IF(Tabelle_Auswertung[[#This Row],[Platz]]=5,CONCATENATE(Tabelle_Auswertung[[#This Row],[Bildname]],\" von \",Tabelle_Auswertung[[#This Row],[Autor(in)]]),\"\")","v":""},{"$f":"IF(Tabelle_Auswertung[[#This Row],[Platz]]=6,CONCATENATE(Tabelle_Auswertung[[#This Row],[Bildname]],\" von \",Tabelle_Auswertung[[#This Row],[Autor(in)]]),\"\")","v":""},{"$f":"IF(Tabelle_Auswertung[[#This Row],[Platz]]=7,CONCATENATE(Tabelle_Auswertung[[#This Row],[Bildname]],\" von \",Tabelle_Auswertung[[#This Row],[Autor(in)]]),\"\")","v":""},{"$f":"IF(Tabelle_Auswertung[[#This Row],[Platz]]=8,CONCATENATE(Tabelle_Auswertung[[#This Row],[Bildname]],\" von \",Tabelle_Auswertung[[#This Row],[Autor(in)]]),\"\")","v":""},{"$f":"IF(Tabelle_Auswertung[[#This Row],[Platz]]=9,CONCATENATE(Tabelle_Auswertung[[#This Row],[Bildname]],\" von \",Tabelle_Auswertung[[#This Row],[Autor(in)]]),\"\")","v":""},{"$f":"IF(Tabelle_Auswertung[[#This Row],[Platz]]=10,CONCATENATE(Tabelle_Auswertung[[#This Row],[Bildname]],\" von \",Tabelle_Auswertung[[#This Row],[Autor(in)]]),\"\")","v":""}]
[126,{"$nulls":21},{"$f":"IF(Tabelle_Auswertung[[#This Row],[Bildname]]<>\"\",\n    IF(Tabelle_Auswertung[[#This Row],[abwesend]]=\"ja\",\n        SUM(Tabelle_Auswertung[[#This Row],[Juror 1]:[Juror 20]])/COUNT(Tabelle_Auswertung[[#This Row],[Juror 1]:[Juror 20]])*(COUNT(Tabelle_Auswertung[[#This Row],[Juror 1]:[Juror 20]])-1),\n        SUM(Tabelle_Auswertung[[#This Row],[Juror 1]:[Juror 20]])\n    ),\n\" - \")","v":" - "},{"$f":"IF(Tabelle_Auswertung[[#This Row],[Bildname]]<>\"\",IF(Tabelle_Auswertung[[#This Row],[Punkte]]>0,AVERAGE(Tabelle_Auswertung[[#This Row],[Juror 1]:[Juror 20]]),\" - \"),\" - \")","v":" - "},{"$f":"IF(Tabelle_Auswertung[[#This Row],[Bildname]]<>\"\",IF(Tabelle_Auswertung[[#This Row],[Punkte]]>0,RANK(Tabelle_Auswertung[[#This Row],[Punkte]],[Punkte],0),\" - \"),\" - \")","v":" - "}," - - -",null,{"$f":"IF(Tabelle_Auswertung[[#This Row],[Platz]]=1,CONCATENATE(Tabelle_Auswertung[[#This Row],[Bildname]],\" von \",Tabelle_Auswertung[[#This Row],[Autor(in)]]),\"\")","v":""},{"$f":"IF(Tabelle_Auswertung[[#This Row],[Platz]]=2,CONCATENATE(Tabelle_Auswertung[[#This Row],[Bildname]],\" von \",Tabelle_Auswertung[[#This Row],[Autor(in)]]),\"\")","v":""},{"$f":"IF(Tabelle_Auswertung[[#This Row],[Platz]]=3,CONCATENATE(Tabelle_Auswertung[[#This Row],[Bildname]],\" von \",Tabelle_Auswertung[[#This Row],[Autor(in)]]),\"\")","v":""},{"$f":"IF(Tabelle_Auswertung[[#This Row],[Platz]]=4,CONCATENATE(Tabelle_Auswertung[[#This Row],[Bildname]],\" von \",Tabelle_Auswertung[[#This Row],[Autor(in)]]),\"\")","v":""},{"$f":"IF(Tabelle_Auswertung[[#This Row],[Platz]]=5,CONCATENATE(Tabelle_Auswertung[[#This Row],[Bildname]],\" von \",Tabelle_Auswertung[[#This Row],[Autor(in)]]),\"\")","v":""},{"$f":"IF(Tabelle_Auswertung[[#This Row],[Platz]]=6,CONCATENATE(Tabelle_Auswertung[[#This Row],[Bildname]],\" von \",Tabelle_Auswertung[[#This Row],[Autor(in)]]),\"\")","v":""},{"$f":"IF(Tabelle_Auswertung[[#This Row],[Platz]]=7,CONCATENATE(Tabelle_Auswertung[[#This Row],[Bildname]],\" von \",Tabelle_Auswertung[[#This Row],[Autor(in)]]),\"\")","v":""},{"$f":"IF(Tabelle_Auswertung[[#This Row],[Platz]]=8,CONCATENATE(Tabelle_Auswertung[[#This Row],[Bildname]],\" von \",Tabelle_Auswertung[[#This Row],[Autor(in)]]),\"\")","v":""},{"$f":"IF(Tabelle_Auswertung[[#This Row],[Platz]]=9,CONCATENATE(Tabelle_Auswertung[[#This Row],[Bildname]],\" von \",Tabelle_Auswertung[[#This Row],[Autor(in)]]),\"\")","v":""},{"$f":"IF(Tabelle_Auswertung[[#This Row],[Platz]]=10,CONCATENATE(Tabelle_Auswertung[[#This Row],[Bildname]],\" von \",Tabelle_Auswertung[[#This Row],[Autor(in)]]),\"\")","v":""}]
[127,{"$nulls":21},{"$f":"IF(Tabelle_Auswertung[[#This Row],[Bildname]]<>\"\",\n    IF(Tabelle_Auswertung[[#This Row],[abwesend]]=\"ja\",\n        SUM(Tabelle_Auswertung[[#This Row],[Juror 1]:[Juror 20]])/COUNT(Tabelle_Auswertung[[#This Row],[Juror 1]:[Juror 20]])*(COUNT(Tabelle_Auswertung[[#This Row],[Juror 1]:[Juror 20]])-1),\n        SUM(Tabelle_Auswertung[[#This Row],[Juror 1]:[Juror 20]])\n    ),\n\" - \")","v":" - "},{"$f":"IF(Tabelle_Auswertung[[#This Row],[Bildname]]<>\"\",IF(Tabelle_Auswertung[[#This Row],[Punkte]]>0,AVERAGE(Tabelle_Auswertung[[#This Row],[Juror 1]:[Juror 20]]),\" - \"),\" - \")","v":" - "},{"$f":"IF(Tabelle_Auswertung[[#This Row],[Bildname]]<>\"\",IF(Tabelle_Auswertung[[#This Row],[Punkte]]>0,RANK(Tabelle_Auswertung[[#This Row],[Punkte]],[Punkte],0),\" - \"),\" - \")","v":" - "}," - - -",null,{"$f":"IF(Tabelle_Auswertung[[#This Row],[Platz]]=1,CONCATENATE(Tabelle_Auswertung[[#This Row],[Bildname]],\" von \",Tabelle_Auswertung[[#This Row],[Autor(in)]]),\"\")","v":""},{"$f":"IF(Tabelle_Auswertung[[#This Row],[Platz]]=2,CONCATENATE(Tabelle_Auswertung[[#This Row],[Bildname]],\" von \",Tabelle_Auswertung[[#This Row],[Autor(in)]]),\"\")","v":""},{"$f":"IF(Tabelle_Auswertung[[#This Row],[Platz]]=3,CONCATENATE(Tabelle_Auswertung[[#This Row],[Bildname]],\" von \",Tabelle_Auswertung[[#This Row],[Autor(in)]]),\"\")","v":""},{"$f":"IF(Tabelle_Auswertung[[#This Row],[Platz]]=4,CONCATENATE(Tabelle_Auswertung[[#This Row],[Bildname]],\" von \",Tabelle_Auswertung[[#This Row],[Autor(in)]]),\"\")","v":""},{"$f":"IF(Tabelle_Auswertung[[#This Row],[Platz]]=5,CONCATENATE(Tabelle_Auswertung[[#This Row],[Bildname]],\" von \",Tabelle_Auswertung[[#This Row],[Autor(in)]]),\"\")","v":""},{"$f":"IF(Tabelle_Auswertung[[#This Row],[Platz]]=6,CONCATENATE(Tabelle_Auswertung[[#This Row],[Bildname]],\" von \",Tabelle_Auswertung[[#This Row],[Autor(in)]]),\"\")","v":""},{"$f":"IF(Tabelle_Auswertung[[#This Row],[Platz]]=7,CONCATENATE(Tabelle_Auswertung[[#This Row],[Bildname]],\" von \",Tabelle_Auswertung[[#This Row],[Autor(in)]]),\"\")","v":""},{"$f":"IF(Tabelle_Auswertung[[#This Row],[Platz]]=8,CONCATENATE(Tabelle_Auswertung[[#This Row],[Bildname]],\" von \",Tabelle_Auswertung[[#This Row],[Autor(in)]]),\"\")","v":""},{"$f":"IF(Tabelle_Auswertung[[#This Row],[Platz]]=9,CONCATENATE(Tabelle_Auswertung[[#This Row],[Bildname]],\" von \",Tabelle_Auswertung[[#This Row],[Autor(in)]]),\"\")","v":""},{"$f":"IF(Tabelle_Auswertung[[#This Row],[Platz]]=10,CONCATENATE(Tabelle_Auswertung[[#This Row],[Bildname]],\" von \",Tabelle_Auswertung[[#This Row],[Autor(in)]]),\"\")","v":""}]
[128,{"$nulls":21},{"$f":"IF(Tabelle_Auswertung[[#This Row],[Bildname]]<>\"\",\n    IF(Tabelle_Auswertung[[#This Row],[abwesend]]=\"ja\",\n        SUM(Tabelle_Auswertung[[#This Row],[Juror 1]:[Juror 20]])/COUNT(Tabelle_Auswertung[[#This Row],[Juror 1]:[Juror 20]])*(COUNT(Tabelle_Auswertung[[#This Row],[Juror 1]:[Juror 20]])-1),\n        SUM(Tabelle_Auswertung[[#This Row],[Juror 1]:[Juror 20]])\n    ),\n\" - \")","v":" - "},{"$f":"IF(Tabelle_Auswertung[[#This Row],[Bildname]]<>\"\",IF(Tabelle_Auswertung[[#This Row],[Punkte]]>0,AVERAGE(Tabelle_Auswertung[[#This Row],[Juror 1]:[Juror 20]]),\" - \"),\" - \")","v":" - "},{"$f":"IF(Tabelle_Auswertung[[#This Row],[Bildname]]<>\"\",IF(Tabelle_Auswertung[[#This Row],[Punkte]]>0,RANK(Tabelle_Auswertung[[#This Row],[Punkte]],[Punkte],0),\" - \"),\" - \")","v":" - "}," - - -",null,{"$f":"IF(Tabelle_Auswertung[[#This Row],[Platz]]=1,CONCATENATE(Tabelle_Auswertung[[#This Row],[Bildname]],\" von \",Tabelle_Auswertung[[#This Row],[Autor(in)]]),\"\")","v":""},{"$f":"IF(Tabelle_Auswertung[[#This Row],[Platz]]=2,CONCATENATE(Tabelle_Auswertung[[#This Row],[Bildname]],\" von \",Tabelle_Auswertung[[#This Row],[Autor(in)]]),\"\")","v":""},{"$f":"IF(Tabelle_Auswertung[[#This Row],[Platz]]=3,CONCATENATE(Tabelle_Auswertung[[#This Row],[Bildname]],\" von \",Tabelle_Auswertung[[#This Row],[Autor(in)]]),\"\")","v":""},{"$f":"IF(Tabelle_Auswertung[[#This Row],[Platz]]=4,CONCATENATE(Tabelle_Auswertung[[#This Row],[Bildname]],\" von \",Tabelle_Auswertung[[#This Row],[Autor(in)]]),\"\")","v":""},{"$f":"IF(Tabelle_Auswertung[[#This Row],[Platz]]=5,CONCATENATE(Tabelle_Auswertung[[#This Row],[Bildname]],\" von \",Tabelle_Auswertung[[#This Row],[Autor(in)]]),\"\")","v":""},{"$f":"IF(Tabelle_Auswertung[[#This Row],[Platz]]=6,CONCATENATE(Tabelle_Auswertung[[#This Row],[Bildname]],\" von \",Tabelle_Auswertung[[#This Row],[Autor(in)]]),\"\")","v":""},{"$f":"IF(Tabelle_Auswertung[[#This Row],[Platz]]=7,CONCATENATE(Tabelle_Auswertung[[#This Row],[Bildname]],\" von \",Tabelle_Auswertung[[#This Row],[Autor(in)]]),\"\")","v":""},{"$f":"IF(Tabelle_Auswertung[[#This Row],[Platz]]=8,CONCATENATE(Tabelle_Auswertung[[#This Row],[Bildname]],\" von \",Tabelle_Auswertung[[#This Row],[Autor(in)]]),\"\")","v":""},{"$f":"IF(Tabelle_Auswertung[[#This Row],[Platz]]=9,CONCATENATE(Tabelle_Auswertung[[#This Row],[Bildname]],\" von \",Tabelle_Auswertung[[#This Row],[Autor(in)]]),\"\")","v":""},{"$f":"IF(Tabelle_Auswertung[[#This Row],[Platz]]=10,CONCATENATE(Tabelle_Auswertung[[#This Row],[Bildname]],\" von \",Tabelle_Auswertung[[#This Row],[Autor(in)]]),\"\")","v":""}]
[129,{"$nulls":21},{"$f":"IF(Tabelle_Auswertung[[#This Row],[Bildname]]<>\"\",\n    IF(Tabelle_Auswertung[[#This Row],[abwesend]]=\"ja\",\n        SUM(Tabelle_Auswertung[[#This Row],[Juror 1]:[Juror 20]])/COUNT(Tabelle_Auswertung[[#This Row],[Juror 1]:[Juror 20]])*(COUNT(Tabelle_Auswertung[[#This Row],[Juror 1]:[Juror 20]])-1),\n        SUM(Tabelle_Auswertung[[#This Row],[Juror 1]:[Juror 20]])\n    ),\n\" - \")","v":" - "},{"$f":"IF(Tabelle_Auswertung[[#This Row],[Bildname]]<>\"\",IF(Tabelle_Auswertung[[#This Row],[Punkte]]>0,AVERAGE(Tabelle_Auswertung[[#This Row],[Juror 1]:[Juror 20]]),\" - \"),\" - \")","v":" - "},{"$f":"IF(Tabelle_Auswertung[[#This Row],[Bildname]]<>\"\",IF(Tabelle_Auswertung[[#This Row],[Punkte]]>0,RANK(Tabelle_Auswertung[[#This Row],[Punkte]],[Punkte],0),\" - \"),\" - \")","v":" - "}," - - -",null,{"$f":"IF(Tabelle_Auswertung[[#This Row],[Platz]]=1,CONCATENATE(Tabelle_Auswertung[[#This Row],[Bildname]],\" von \",Tabelle_Auswertung[[#This Row],[Autor(in)]]),\"\")","v":""},{"$f":"IF(Tabelle_Auswertung[[#This Row],[Platz]]=2,CONCATENATE(Tabelle_Auswertung[[#This Row],[Bildname]],\" von \",Tabelle_Auswertung[[#This Row],[Autor(in)]]),\"\")","v":""},{"$f":"IF(Tabelle_Auswertung[[#This Row],[Platz]]=3,CONCATENATE(Tabelle_Auswertung[[#This Row],[Bildname]],\" von \",Tabelle_Auswertung[[#This Row],[Autor(in)]]),\"\")","v":""},{"$f":"IF(Tabelle_Auswertung[[#This Row],[Platz]]=4,CONCATENATE(Tabelle_Auswertung[[#This Row],[Bildname]],\" von \",Tabelle_Auswertung[[#This Row],[Autor(in)]]),\"\")","v":""},{"$f":"IF(Tabelle_Auswertung[[#This Row],[Platz]]=5,CONCATENATE(Tabelle_Auswertung[[#This Row],[Bildname]],\" von \",Tabelle_Auswertung[[#This Row],[Autor(in)]]),\"\")","v":""},{"$f":"IF(Tabelle_Auswertung[[#This Row],[Platz]]=6,CONCATENATE(Tabelle_Auswertung[[#This Row],[Bildname]],\" von \",Tabelle_Auswertung[[#This Row],[Autor(in)]]),\"\")","v":""},{"$f":"IF(Tabelle_Auswertung[[#This Row],[Platz]]=7,CONCATENATE(Tabelle_Auswertung[[#This Row],[Bildname]],\" von \",Tabelle_Auswertung[[#This Row],[Autor(in)]]),\"\")","v":""},{"$f":"IF(Tabelle_Auswertung[[#This Row],[Platz]]=8,CONCATENATE(Tabelle_Auswertung[[#This Row],[Bildname]],\" von \",Tabelle_Auswertung[[#This Row],[Autor(in)]]),\"\")","v":""},{"$f":"IF(Tabelle_Auswertung[[#This Row],[Platz]]=9,CONCATENATE(Tabelle_Auswertung[[#This Row],[Bildname]],\" von \",Tabelle_Auswertung[[#This Row],[Autor(in)]]),\"\")","v":""},{"$f":"IF(Tabelle_Auswertung[[#This Row],[Platz]]=10,CONCATENATE(Tabelle_Auswertung[[#This Row],[Bildname]],\" von \",Tabelle_Auswertung[[#This Row],[Autor(in)]]),\"\")","v":""}]
[130,{"$nulls":21},{"$f":"IF(Tabelle_Auswertung[[#This Row],[Bildname]]<>\"\",\n    IF(Tabelle_Auswertung[[#This Row],[abwesend]]=\"ja\",\n        SUM(Tabelle_Auswertung[[#This Row],[Juror 1]:[Juror 20]])/COUNT(Tabelle_Auswertung[[#This Row],[Juror 1]:[Juror 20]])*(COUNT(Tabelle_Auswertung[[#This Row],[Juror 1]:[Juror 20]])-1),\n        SUM(Tabelle_Auswertung[[#This Row],[Juror 1]:[Juror 20]])\n    ),\n\" - \")","v":" - "},{"$f":"IF(Tabelle_Auswertung[[#This Row],[Bildname]]<>\"\",IF(Tabelle_Auswertung[[#This Row],[Punkte]]>0,AVERAGE(Tabelle_Auswertung[[#This Row],[Juror 1]:[Juror 20]]),\" - \"),\" - \")","v":" - "},{"$f":"IF(Tabelle_Auswertung[[#This Row],[Bildname]]<>\"\",IF(Tabelle_Auswertung[[#This Row],[Punkte]]>0,RANK(Tabelle_Auswertung[[#This Row],[Punkte]],[Punkte],0),\" - \"),\" - \")","v":" - "}," - - -",null,{"$f":"IF(Tabelle_Auswertung[[#This Row],[Platz]]=1,CONCATENATE(Tabelle_Auswertung[[#This Row],[Bildname]],\" von \",Tabelle_Auswertung[[#This Row],[Autor(in)]]),\"\")","v":""},{"$f":"IF(Tabelle_Auswertung[[#This Row],[Platz]]=2,CONCATENATE(Tabelle_Auswertung[[#This Row],[Bildname]],\" von \",Tabelle_Auswertung[[#This Row],[Autor(in)]]),\"\")","v":""},{"$f":"IF(Tabelle_Auswertung[[#This Row],[Platz]]=3,CONCATENATE(Tabelle_Auswertung[[#This Row],[Bildname]],\" von \",Tabelle_Auswertung[[#This Row],[Autor(in)]]),\"\")","v":""},{"$f":"IF(Tabelle_Auswertung[[#This Row],[Platz]]=4,CONCATENATE(Tabelle_Auswertung[[#This Row],[Bildname]],\" von \",Tabelle_Auswertung[[#This Row],[Autor(in)]]),\"\")","v":""},{"$f":"IF(Tabelle_Auswertung[[#This Row],[Platz]]=5,CONCATENATE(Tabelle_Auswertung[[#This Row],[Bildname]],\" von \",Tabelle_Auswertung[[#This Row],[Autor(in)]]),\"\")","v":""},{"$f":"IF(Tabelle_Auswertung[[#This Row],[Platz]]=6,CONCATENATE(Tabelle_Auswertung[[#This Row],[Bildname]],\" von \",Tabelle_Auswertung[[#This Row],[Autor(in)]]),\"\")","v":""},{"$f":"IF(Tabelle_Auswertung[[#This Row],[Platz]]=7,CONCATENATE(Tabelle_Auswertung[[#This Row],[Bildname]],\" von \",Tabelle_Auswertung[[#This Row],[Autor(in)]]),\"\")","v":""},{"$f":"IF(Tabelle_Auswertung[[#This Row],[Platz]]=8,CONCATENATE(Tabelle_Auswertung[[#This Row],[Bildname]],\" von \",Tabelle_Auswertung[[#This Row],[Autor(in)]]),\"\")","v":""},{"$f":"IF(Tabelle_Auswertung[[#This Row],[Platz]]=9,CONCATENATE(Tabelle_Auswertung[[#This Row],[Bildname]],\" von \",Tabelle_Auswertung[[#This Row],[Autor(in)]]),\"\")","v":""},{"$f":"IF(Tabelle_Auswertung[[#This Row],[Platz]]=10,CONCATENATE(Tabelle_Auswertung[[#This Row],[Bildname]],\" von \",Tabelle_Auswertung[[#This Row],[Autor(in)]]),\"\")","v":""}]
[131,{"$nulls":21},{"$f":"IF(Tabelle_Auswertung[[#This Row],[Bildname]]<>\"\",\n    IF(Tabelle_Auswertung[[#This Row],[abwesend]]=\"ja\",\n        SUM(Tabelle_Auswertung[[#This Row],[Juror 1]:[Juror 20]])/COUNT(Tabelle_Auswertung[[#This Row],[Juror 1]:[Juror 20]])*(COUNT(Tabelle_Auswertung[[#This Row],[Juror 1]:[Juror 20]])-1),\n        SUM(Tabelle_Auswertung[[#This Row],[Juror 1]:[Juror 20]])\n    ),\n\" - \")","v":" - "},{"$f":"IF(Tabelle_Auswertung[[#This Row],[Bildname]]<>\"\",IF(Tabelle_Auswertung[[#This Row],[Punkte]]>0,AVERAGE(Tabelle_Auswertung[[#This Row],[Juror 1]:[Juror 20]]),\" - \"),\" - \")","v":" - "},{"$f":"IF(Tabelle_Auswertung[[#This Row],[Bildname]]<>\"\",IF(Tabelle_Auswertung[[#This Row],[Punkte]]>0,RANK(Tabelle_Auswertung[[#This Row],[Punkte]],[Punkte],0),\" - \"),\" - \")","v":" - "}," - - -",null,{"$f":"IF(Tabelle_Auswertung[[#This Row],[Platz]]=1,CONCATENATE(Tabelle_Auswertung[[#This Row],[Bildname]],\" von \",Tabelle_Auswertung[[#This Row],[Autor(in)]]),\"\")","v":""},{"$f":"IF(Tabelle_Auswertung[[#This Row],[Platz]]=2,CONCATENATE(Tabelle_Auswertung[[#This Row],[Bildname]],\" von \",Tabelle_Auswertung[[#This Row],[Autor(in)]]),\"\")","v":""},{"$f":"IF(Tabelle_Auswertung[[#This Row],[Platz]]=3,CONCATENATE(Tabelle_Auswertung[[#This Row],[Bildname]],\" von \",Tabelle_Auswertung[[#This Row],[Autor(in)]]),\"\")","v":""},{"$f":"IF(Tabelle_Auswertung[[#This Row],[Platz]]=4,CONCATENATE(Tabelle_Auswertung[[#This Row],[Bildname]],\" von \",Tabelle_Auswertung[[#This Row],[Autor(in)]]),\"\")","v":""},{"$f":"IF(Tabelle_Auswertung[[#This Row],[Platz]]=5,CONCATENATE(Tabelle_Auswertung[[#This Row],[Bildname]],\" von \",Tabelle_Auswertung[[#This Row],[Autor(in)]]),\"\")","v":""},{"$f":"IF(Tabelle_Auswertung[[#This Row],[Platz]]=6,CONCATENATE(Tabelle_Auswertung[[#This Row],[Bildname]],\" von \",Tabelle_Auswertung[[#This Row],[Autor(in)]]),\"\")","v":""},{"$f":"IF(Tabelle_Auswertung[[#This Row],[Platz]]=7,CONCATENATE(Tabelle_Auswertung[[#This Row],[Bildname]],\" von \",Tabelle_Auswertung[[#This Row],[Autor(in)]]),\"\")","v":""},{"$f":"IF(Tabelle_Auswertung[[#This Row],[Platz]]=8,CONCATENATE(Tabelle_Auswertung[[#This Row],[Bildname]],\" von \",Tabelle_Auswertung[[#This Row],[Autor(in)]]),\"\")","v":""},{"$f":"IF(Tabelle_Auswertung[[#This Row],[Platz]]=9,CONCATENATE(Tabelle_Auswertung[[#This Row],[Bildname]],\" von \",Tabelle_Auswertung[[#This Row],[Autor(in)]]),\"\")","v":""},{"$f":"IF(Tabelle_Auswertung[[#This Row],[Platz]]=10,CONCATENATE(Tabelle_Auswertung[[#This Row],[Bildname]],\" von \",Tabelle_Auswertung[[#This Row],[Autor(in)]]),\"\")","v":""}]
[132,{"$nulls":21},{"$f":"IF(Tabelle_Auswertung[[#This Row],[Bildname]]<>\"\",\n    IF(Tabelle_Auswertung[[#This Row],[abwesend]]=\"ja\",\n        SUM(Tabelle_Auswertung[[#This Row],[Juror 1]:[Juror 20]])/COUNT(Tabelle_Auswertung[[#This Row],[Juror 1]:[Juror 20]])*(COUNT(Tabelle_Auswertung[[#This Row],[Juror 1]:[Juror 20]])-1),\n        SUM(Tabelle_Auswertung[[#This Row],[Juror 1]:[Juror 20]])\n    ),\n\" - \")","v":" - "},{"$f":"IF(Tabelle_Auswertung[[#This Row],[Bildname]]<>\"\",IF(Tabelle_Auswertung[[#This Row],[Punkte]]>0,AVERAGE(Tabelle_Auswertung[[#This Row],[Juror 1]:[Juror 20]]),\" - \"),\" - \")","v":" - "},{"$f":"IF(Tabelle_Auswertung[[#This Row],[Bildname]]<>\"\",IF(Tabelle_Auswertung[[#This Row],[Punkte]]>0,RANK(Tabelle_Auswertung[[#This Row],[Punkte]],[Punkte],0),\" - \"),\" - \")","v":" - "}," - - -",null,{"$f":"IF(Tabelle_Auswertung[[#This Row],[Platz]]=1,CONCATENATE(Tabelle_Auswertung[[#This Row],[Bildname]],\" von \",Tabelle_Auswertung[[#This Row],[Autor(in)]]),\"\")","v":""},{"$f":"IF(Tabelle_Auswertung[[#This Row],[Platz]]=2,CONCATENATE(Tabelle_Auswertung[[#This Row],[Bildname]],\" von \",Tabelle_Auswertung[[#This Row],[Autor(in)]]),\"\")","v":""},{"$f":"IF(Tabelle_Auswertung[[#This Row],[Platz]]=3,CONCATENATE(Tabelle_Auswertung[[#This Row],[Bildname]],\" von \",Tabelle_Auswertung[[#This Row],[Autor(in)]]),\"\")","v":""},{"$f":"IF(Tabelle_Auswertung[[#This Row],[Platz]]=4,CONCATENATE(Tabelle_Auswertung[[#This Row],[Bildname]],\" von \",Tabelle_Auswertung[[#This Row],[Autor(in)]]),\"\")","v":""},{"$f":"IF(Tabelle_Auswertung[[#This Row],[Platz]]=5,CONCATENATE(Tabelle_Auswertung[[#This Row],[Bildname]],\" von \",Tabelle_Auswertung[[#This Row],[Autor(in)]]),\"\")","v":""},{"$f":"IF(Tabelle_Auswertung[[#This Row],[Platz]]=6,CONCATENATE(Tabelle_Auswertung[[#This Row],[Bildname]],\" von \",Tabelle_Auswertung[[#This Row],[Autor(in)]]),\"\")","v":""},{"$f":"IF(Tabelle_Auswertung[[#This Row],[Platz]]=7,CONCATENATE(Tabelle_Auswertung[[#This Row],[Bildname]],\" von \",Tabelle_Auswertung[[#This Row],[Autor(in)]]),\"\")","v":""},{"$f":"IF(Tabelle_Auswertung[[#This Row],[Platz]]=8,CONCATENATE(Tabelle_Auswertung[[#This Row],[Bildname]],\" von \",Tabelle_Auswertung[[#This Row],[Autor(in)]]),\"\")","v":""},{"$f":"IF(Tabelle_Auswertung[[#This Row],[Platz]]=9,CONCATENATE(Tabelle_Auswertung[[#This Row],[Bildname]],\" von \",Tabelle_Auswertung[[#This Row],[Autor(in)]]),\"\")","v":""},{"$f":"IF(Tabelle_Auswertung[[#This Row],[Platz]]=10,CONCATENATE(Tabelle_Auswertung[[#This Row],[Bildname]],\" von \",Tabelle_Auswertung[[#This Row],[Autor(in)]]),\"\")","v":""}]
[133,{"$nulls":21},{"$f":"IF(Tabelle_Auswertung[[#This Row],[Bildname]]<>\"\",\n    IF(Tabelle_Auswertung[[#This Row],[abwesend]]=\"ja\",\n        SUM(Tabelle_Auswertung[[#This Row],[Juror 1]:[Juror 20]])/COUNT(Tabelle_Auswertung[[#This Row],[Juror 1]:[Juror 20]])*(COUNT(Tabelle_Auswertung[[#This Row],[Juror 1]:[Juror 20]])-1),\n        SUM(Tabelle_Auswertung[[#This Row],[Juror 1]:[Juror 20]])\n    ),\n\" - \")","v":" - "},{"$f":"IF(Tabelle_Auswertung[[#This Row],[Bildname]]<>\"\",IF(Tabelle_Auswertung[[#This Row],[Punkte]]>0,AVERAGE(Tabelle_Auswertung[[#This Row],[Juror 1]:[Juror 20]]),\" - \"),\" - \")","v":" - "},{"$f":"IF(Tabelle_Auswertung[[#This Row],[Bildname]]<>\"\",IF(Tabelle_Auswertung[[#This Row],[Punkte]]>0,RANK(Tabelle_Auswertung[[#This Row],[Punkte]],[Punkte],0),\" - \"),\" - \")","v":" - "}," - - -",null,{"$f":"IF(Tabelle_Auswertung[[#This Row],[Platz]]=1,CONCATENATE(Tabelle_Auswertung[[#This Row],[Bildname]],\" von \",Tabelle_Auswertung[[#This Row],[Autor(in)]]),\"\")","v":""},{"$f":"IF(Tabelle_Auswertung[[#This Row],[Platz]]=2,CONCATENATE(Tabelle_Auswertung[[#This Row],[Bildname]],\" von \",Tabelle_Auswertung[[#This Row],[Autor(in)]]),\"\")","v":""},{"$f":"IF(Tabelle_Auswertung[[#This Row],[Platz]]=3,CONCATENATE(Tabelle_Auswertung[[#This Row],[Bildname]],\" von \",Tabelle_Auswertung[[#This Row],[Autor(in)]]),\"\")","v":""},{"$f":"IF(Tabelle_Auswertung[[#This Row],[Platz]]=4,CONCATENATE(Tabelle_Auswertung[[#This Row],[Bildname]],\" von \",Tabelle_Auswertung[[#This Row],[Autor(in)]]),\"\")","v":""},{"$f":"IF(Tabelle_Auswertung[[#This Row],[Platz]]=5,CONCATENATE(Tabelle_Auswertung[[#This Row],[Bildname]],\" von \",Tabelle_Auswertung[[#This Row],[Autor(in)]]),\"\")","v":""},{"$f":"IF(Tabelle_Auswertung[[#This Row],[Platz]]=6,CONCATENATE(Tabelle_Auswertung[[#This Row],[Bildname]],\" von \",Tabelle_Auswertung[[#This Row],[Autor(in)]]),\"\")","v":""},{"$f":"IF(Tabelle_Auswertung[[#This Row],[Platz]]=7,CONCATENATE(Tabelle_Auswertung[[#This Row],[Bildname]],\" von \",Tabelle_Auswertung[[#This Row],[Autor(in)]]),\"\")","v":""},{"$f":"IF(Tabelle_Auswertung[[#This Row],[Platz]]=8,CONCATENATE(Tabelle_Auswertung[[#This Row],[Bildname]],\" von \",Tabelle_Auswertung[[#This Row],[Autor(in)]]),\"\")","v":""},{"$f":"IF(Tabelle_Auswertung[[#This Row],[Platz]]=9,CONCATENATE(Tabelle_Auswertung[[#This Row],[Bildname]],\" von \",Tabelle_Auswertung[[#This Row],[Autor(in)]]),\"\")","v":""},{"$f":"IF(Tabelle_Auswertung[[#This Row],[Platz]]=10,CONCATENATE(Tabelle_Auswertung[[#This Row],[Bildname]],\" von \",Tabelle_Auswertung[[#This Row],[Autor(in)]]),\"\")","v":""}]
[134,{"$nulls":21},{"$f":"IF(Tabelle_Auswertung[[#This Row],[Bildname]]<>\"\",\n    IF(Tabelle_Auswertung[[#This Row],[abwesend]]=\"ja\",\n        SUM(Tabelle_Auswertung[[#This Row],[Juror 1]:[Juror 20]])/COUNT(Tabelle_Auswertung[[#This Row],[Juror 1]:[Juror 20]])*(COUNT(Tabelle_Auswertung[[#This Row],[Juror 1]:[Juror 20]])-1),\n        SUM(Tabelle_Auswertung[[#This Row],[Juror 1]:[Juror 20]])\n    ),\n\" - \")","v":" - "},{"$f":"IF(Tabelle_Auswertung[[#This Row],[Bildname]]<>\"\",IF(Tabelle_Auswertung[[#This Row],[Punkte]]>0,AVERAGE(Tabelle_Auswertung[[#This Row],[Juror 1]:[Juror 20]]),\" - \"),\" - \")","v":" - "},{"$f":"IF(Tabelle_Auswertung[[#This Row],[Bildname]]<>\"\",IF(Tabelle_Auswertung[[#This Row],[Punkte]]>0,RANK(Tabelle_Auswertung[[#This Row],[Punkte]],[Punkte],0),\" - \"),\" - \")","v":" - "}," - - -",null,{"$f":"IF(Tabelle_Auswertung[[#This Row],[Platz]]=1,CONCATENATE(Tabelle_Auswertung[[#This Row],[Bildname]],\" von \",Tabelle_Auswertung[[#This Row],[Autor(in)]]),\"\")","v":""},{"$f":"IF(Tabelle_Auswertung[[#This Row],[Platz]]=2,CONCATENATE(Tabelle_Auswertung[[#This Row],[Bildname]],\" von \",Tabelle_Auswertung[[#This Row],[Autor(in)]]),\"\")","v":""},{"$f":"IF(Tabelle_Auswertung[[#This Row],[Platz]]=3,CONCATENATE(Tabelle_Auswertung[[#This Row],[Bildname]],\" von \",Tabelle_Auswertung[[#This Row],[Autor(in)]]),\"\")","v":""},{"$f":"IF(Tabelle_Auswertung[[#This Row],[Platz]]=4,CONCATENATE(Tabelle_Auswertung[[#This Row],[Bildname]],\" von \",Tabelle_Auswertung[[#This Row],[Autor(in)]]),\"\")","v":""},{"$f":"IF(Tabelle_Auswertung[[#This Row],[Platz]]=5,CONCATENATE(Tabelle_Auswertung[[#This Row],[Bildname]],\" von \",Tabelle_Auswertung[[#This Row],[Autor(in)]]),\"\")","v":""},{"$f":"IF(Tabelle_Auswertung[[#This Row],[Platz]]=6,CONCATENATE(Tabelle_Auswertung[[#This Row],[Bildname]],\" von \",Tabelle_Auswertung[[#This Row],[Autor(in)]]),\"\")","v":""},{"$f":"IF(Tabelle_Auswertung[[#This Row],[Platz]]=7,CONCATENATE(Tabelle_Auswertung[[#This Row],[Bildname]],\" von \",Tabelle_Auswertung[[#This Row],[Autor(in)]]),\"\")","v":""},{"$f":"IF(Tabelle_Auswertung[[#This Row],[Platz]]=8,CONCATENATE(Tabelle_Auswertung[[#This Row],[Bildname]],\" von \",Tabelle_Auswertung[[#This Row],[Autor(in)]]),\"\")","v":""},{"$f":"IF(Tabelle_Auswertung[[#This Row],[Platz]]=9,CONCATENATE(Tabelle_Auswertung[[#This Row],[Bildname]],\" von \",Tabelle_Auswertung[[#This Row],[Autor(in)]]),\"\")","v":""},{"$f":"IF(Tabelle_Auswertung[[#This Row],[Platz]]=10,CONCATENATE(Tabelle_Auswertung[[#This Row],[Bildname]],\" von \",Tabelle_Auswertung[[#This Row],[Autor(in)]]),\"\")","v":""}]
[135,{"$nulls":21},{"$f":"IF(Tabelle_Auswertung[[#This Row],[Bildname]]<>\"\",\n    IF(Tabelle_Auswertung[[#This Row],[abwesend]]=\"ja\",\n        SUM(Tabelle_Auswertung[[#This Row],[Juror 1]:[Juror 20]])/COUNT(Tabelle_Auswertung[[#This Row],[Juror 1]:[Juror 20]])*(COUNT(Tabelle_Auswertung[[#This Row],[Juror 1]:[Juror 20]])-1),\n        SUM(Tabelle_Auswertung[[#This Row],[Juror 1]:[Juror 20]])\n    ),\n\" - \")","v":" - "},{"$f":"IF(Tabelle_Auswertung[[#This Row],[Bildname]]<>\"\",IF(Tabelle_Auswertung[[#This Row],[Punkte]]>0,AVERAGE(Tabelle_Auswertung[[#This Row],[Juror 1]:[Juror 20]]),\" - \"),\" - \")","v":" - "},{"$f":"IF(Tabelle_Auswertung[[#This Row],[Bildname]]<>\"\",IF(Tabelle_Auswertung[[#This Row],[Punkte]]>0,RANK(Tabelle_Auswertung[[#This Row],[Punkte]],[Punkte],0),\" - \"),\" - \")","v":" - "}," - - -",null,{"$f":"IF(Tabelle_Auswertung[[#This Row],[Platz]]=1,CONCATENATE(Tabelle_Auswertung[[#This Row],[Bildname]],\" von \",Tabelle_Auswertung[[#This Row],[Autor(in)]]),\"\")","v":""},{"$f":"IF(Tabelle_Auswertung[[#This Row],[Platz]]=2,CONCATENATE(Tabelle_Auswertung[[#This Row],[Bildname]],\" von \",Tabelle_Auswertung[[#This Row],[Autor(in)]]),\"\")","v":""},{"$f":"IF(Tabelle_Auswertung[[#This Row],[Platz]]=3,CONCATENATE(Tabelle_Auswertung[[#This Row],[Bildname]],\" von \",Tabelle_Auswertung[[#This Row],[Autor(in)]]),\"\")","v":""},{"$f":"IF(Tabelle_Auswertung[[#This Row],[Platz]]=4,CONCATENATE(Tabelle_Auswertung[[#This Row],[Bildname]],\" von \",Tabelle_Auswertung[[#This Row],[Autor(in)]]),\"\")","v":""},{"$f":"IF(Tabelle_Auswertung[[#This Row],[Platz]]=5,CONCATENATE(Tabelle_Auswertung[[#This Row],[Bildname]],\" von \",Tabelle_Auswertung[[#This Row],[Autor(in)]]),\"\")","v":""},{"$f":"IF(Tabelle_Auswertung[[#This Row],[Platz]]=6,CONCATENATE(Tabelle_Auswertung[[#This Row],[Bildname]],\" von \",Tabelle_Auswertung[[#This Row],[Autor(in)]]),\"\")","v":""},{"$f":"IF(Tabelle_Auswertung[[#This Row],[Platz]]=7,CONCATENATE(Tabelle_Auswertung[[#This Row],[Bildname]],\" von \",Tabelle_Auswertung[[#This Row],[Autor(in)]]),\"\")","v":""},{"$f":"IF(Tabelle_Auswertung[[#This Row],[Platz]]=8,CONCATENATE(Tabelle_Auswertung[[#This Row],[Bildname]],\" von \",Tabelle_Auswertung[[#This Row],[Autor(in)]]),\"\")","v":""},{"$f":"IF(Tabelle_Auswertung[[#This Row],[Platz]]=9,CONCATENATE(Tabelle_Auswertung[[#This Row],[Bildname]],\" von \",Tabelle_Auswertung[[#This Row],[Autor(in)]]),\"\")","v":""},{"$f":"IF(Tabelle_Auswertung[[#This Row],[Platz]]=10,CONCATENATE(Tabelle_Auswertung[[#This Row],[Bildname]],\" von \",Tabelle_Auswertung[[#This Row],[Autor(in)]]),\"\")","v":""}]
[136,{"$nulls":21},{"$f":"IF(Tabelle_Auswertung[[#This Row],[Bildname]]<>\"\",\n    IF(Tabelle_Auswertung[[#This Row],[abwesend]]=\"ja\",\n        SUM(Tabelle_Auswertung[[#This Row],[Juror 1]:[Juror 20]])/COUNT(Tabelle_Auswertung[[#This Row],[Juror 1]:[Juror 20]])*(COUNT(Tabelle_Auswertung[[#This Row],[Juror 1]:[Juror 20]])-1),\n        SUM(Tabelle_Auswertung[[#This Row],[Juror 1]:[Juror 20]])\n    ),\n\" - \")","v":" - "},{"$f":"IF(Tabelle_Auswertung[[#This Row],[Bildname]]<>\"\",IF(Tabelle_Auswertung[[#This Row],[Punkte]]>0,AVERAGE(Tabelle_Auswertung[[#This Row],[Juror 1]:[Juror 20]]),\" - \"),\" - \")","v":" - "},{"$f":"IF(Tabelle_Auswertung[[#This Row],[Bildname]]<>\"\",IF(Tabelle_Auswertung[[#This Row],[Punkte]]>0,RANK(Tabelle_Auswertung[[#This Row],[Punkte]],[Punkte],0),\" - \"),\" - \")","v":" - "}," - - -",null,{"$f":"IF(Tabelle_Auswertung[[#This Row],[Platz]]=1,CONCATENATE(Tabelle_Auswertung[[#This Row],[Bildname]],\" von \",Tabelle_Auswertung[[#This Row],[Autor(in)]]),\"\")","v":""},{"$f":"IF(Tabelle_Auswertung[[#This Row],[Platz]]=2,CONCATENATE(Tabelle_Auswertung[[#This Row],[Bildname]],\" von \",Tabelle_Auswertung[[#This Row],[Autor(in)]]),\"\")","v":""},{"$f":"IF(Tabelle_Auswertung[[#This Row],[Platz]]=3,CONCATENATE(Tabelle_Auswertung[[#This Row],[Bildname]],\" von \",Tabelle_Auswertung[[#This Row],[Autor(in)]]),\"\")","v":""},{"$f":"IF(Tabelle_Auswertung[[#This Row],[Platz]]=4,CONCATENATE(Tabelle_Auswertung[[#This Row],[Bildname]],\" von \",Tabelle_Auswertung[[#This Row],[Autor(in)]]),\"\")","v":""},{"$f":"IF(Tabelle_Auswertung[[#This Row],[Platz]]=5,CONCATENATE(Tabelle_Auswertung[[#This Row],[Bildname]],\" von \",Tabelle_Auswertung[[#This Row],[Autor(in)]]),\"\")","v":""},{"$f":"IF(Tabelle_Auswertung[[#This Row],[Platz]]=6,CONCATENATE(Tabelle_Auswertung[[#This Row],[Bildname]],\" von \",Tabelle_Auswertung[[#This Row],[Autor(in)]]),\"\")","v":""},{"$f":"IF(Tabelle_Auswertung[[#This Row],[Platz]]=7,CONCATENATE(Tabelle_Auswertung[[#This Row],[Bildname]],\" von \",Tabelle_Auswertung[[#This Row],[Autor(in)]]),\"\")","v":""},{"$f":"IF(Tabelle_Auswertung[[#This Row],[Platz]]=8,CONCATENATE(Tabelle_Auswertung[[#This Row],[Bildname]],\" von \",Tabelle_Auswertung[[#This Row],[Autor(in)]]),\"\")","v":""},{"$f":"IF(Tabelle_Auswertung[[#This Row],[Platz]]=9,CONCATENATE(Tabelle_Auswertung[[#This Row],[Bildname]],\" von \",Tabelle_Auswertung[[#This Row],[Autor(in)]]),\"\")","v":""},{"$f":"IF(Tabelle_Auswertung[[#This Row],[Platz]]=10,CONCATENATE(Tabelle_Auswertung[[#This Row],[Bildname]],\" von \",Tabelle_Auswertung[[#This Row],[Autor(in)]]),\"\")","v":""}]
[137,{"$nulls":21},{"$f":"IF(Tabelle_Auswertung[[#This Row],[Bildname]]<>\"\",\n    IF(Tabelle_Auswertung[[#This Row],[abwesend]]=\"ja\",\n        SUM(Tabelle_Auswertung[[#This Row],[Juror 1]:[Juror 20]])/COUNT(Tabelle_Auswertung[[#This Row],[Juror 1]:[Juror 20]])*(COUNT(Tabelle_Auswertung[[#This Row],[Juror 1]:[Juror 20]])-1),\n        SUM(Tabelle_Auswertung[[#This Row],[Juror 1]:[Juror 20]])\n    ),\n\" - \")","v":" - "},{"$f":"IF(Tabelle_Auswertung[[#This Row],[Bildname]]<>\"\",IF(Tabelle_Auswertung[[#This Row],[Punkte]]>0,AVERAGE(Tabelle_Auswertung[[#This Row],[Juror 1]:[Juror 20]]),\" - \"),\" - \")","v":" - "},{"$f":"IF(Tabelle_Auswertung[[#This Row],[Bildname]]<>\"\",IF(Tabelle_Auswertung[[#This Row],[Punkte]]>0,RANK(Tabelle_Auswertung[[#This Row],[Punkte]],[Punkte],0),\" - \"),\" - \")","v":" - "}," - - -",null,{"$f":"IF(Tabelle_Auswertung[[#This Row],[Platz]]=1,CONCATENATE(Tabelle_Auswertung[[#This Row],[Bildname]],\" von \",Tabelle_Auswertung[[#This Row],[Autor(in)]]),\"\")","v":""},{"$f":"IF(Tabelle_Auswertung[[#This Row],[Platz]]=2,CONCATENATE(Tabelle_Auswertung[[#This Row],[Bildname]],\" von \",Tabelle_Auswertung[[#This Row],[Autor(in)]]),\"\")","v":""},{"$f":"IF(Tabelle_Auswertung[[#This Row],[Platz]]=3,CONCATENATE(Tabelle_Auswertung[[#This Row],[Bildname]],\" von \",Tabelle_Auswertung[[#This Row],[Autor(in)]]),\"\")","v":""},{"$f":"IF(Tabelle_Auswertung[[#This Row],[Platz]]=4,CONCATENATE(Tabelle_Auswertung[[#This Row],[Bildname]],\" von \",Tabelle_Auswertung[[#This Row],[Autor(in)]]),\"\")","v":""},{"$f":"IF(Tabelle_Auswertung[[#This Row],[Platz]]=5,CONCATENATE(Tabelle_Auswertung[[#This Row],[Bildname]],\" von \",Tabelle_Auswertung[[#This Row],[Autor(in)]]),\"\")","v":""},{"$f":"IF(Tabelle_Auswertung[[#This Row],[Platz]]=6,CONCATENATE(Tabelle_Auswertung[[#This Row],[Bildname]],\" von \",Tabelle_Auswertung[[#This Row],[Autor(in)]]),\"\")","v":""},{"$f":"IF(Tabelle_Auswertung[[#This Row],[Platz]]=7,CONCATENATE(Tabelle_Auswertung[[#This Row],[Bildname]],\" von \",Tabelle_Auswertung[[#This Row],[Autor(in)]]),\"\")","v":""},{"$f":"IF(Tabelle_Auswertung[[#This Row],[Platz]]=8,CONCATENATE(Tabelle_Auswertung[[#This Row],[Bildname]],\" von \",Tabelle_Auswertung[[#This Row],[Autor(in)]]),\"\")","v":""},{"$f":"IF(Tabelle_Auswertung[[#This Row],[Platz]]=9,CONCATENATE(Tabelle_Auswertung[[#This Row],[Bildname]],\" von \",Tabelle_Auswertung[[#This Row],[Autor(in)]]),\"\")","v":""},{"$f":"IF(Tabelle_Auswertung[[#This Row],[Platz]]=10,CONCATENATE(Tabelle_Auswertung[[#This Row],[Bildname]],\" von \",Tabelle_Auswertung[[#This Row],[Autor(in)]]),\"\")","v":""}]
[138,{"$nulls":21},{"$f":"IF(Tabelle_Auswertung[[#This Row],[Bildname]]<>\"\",\n    IF(Tabelle_Auswertung[[#This Row],[abwesend]]=\"ja\",\n        SUM(Tabelle_Auswertung[[#This Row],[Juror 1]:[Juror 20]])/COUNT(Tabelle_Auswertung[[#This Row],[Juror 1]:[Juror 20]])*(COUNT(Tabelle_Auswertung[[#This Row],[Juror 1]:[Juror 20]])-1),\n        SUM(Tabelle_Auswertung[[#This Row],[Juror 1]:[Juror 20]])\n    ),\n\" - \")","v":" - "},{"$f":"IF(Tabelle_Auswertung[[#This Row],[Bildname]]<>\"\",IF(Tabelle_Auswertung[[#This Row],[Punkte]]>0,AVERAGE(Tabelle_Auswertung[[#This Row],[Juror 1]:[Juror 20]]),\" - \"),\" - \")","v":" - "},{"$f":"IF(Tabelle_Auswertung[[#This Row],[Bildname]]<>\"\",IF(Tabelle_Auswertung[[#This Row],[Punkte]]>0,RANK(Tabelle_Auswertung[[#This Row],[Punkte]],[Punkte],0),\" - \"),\" - \")","v":" - "}," - - -",null,{"$f":"IF(Tabelle_Auswertung[[#This Row],[Platz]]=1,CONCATENATE(Tabelle_Auswertung[[#This Row],[Bildname]],\" von \",Tabelle_Auswertung[[#This Row],[Autor(in)]]),\"\")","v":""},{"$f":"IF(Tabelle_Auswertung[[#This Row],[Platz]]=2,CONCATENATE(Tabelle_Auswertung[[#This Row],[Bildname]],\" von \",Tabelle_Auswertung[[#This Row],[Autor(in)]]),\"\")","v":""},{"$f":"IF(Tabelle_Auswertung[[#This Row],[Platz]]=3,CONCATENATE(Tabelle_Auswertung[[#This Row],[Bildname]],\" von \",Tabelle_Auswertung[[#This Row],[Autor(in)]]),\"\")","v":""},{"$f":"IF(Tabelle_Auswertung[[#This Row],[Platz]]=4,CONCATENATE(Tabelle_Auswertung[[#This Row],[Bildname]],\" von \",Tabelle_Auswertung[[#This Row],[Autor(in)]]),\"\")","v":""},{"$f":"IF(Tabelle_Auswertung[[#This Row],[Platz]]=5,CONCATENATE(Tabelle_Auswertung[[#This Row],[Bildname]],\" von \",Tabelle_Auswertung[[#This Row],[Autor(in)]]),\"\")","v":""},{"$f":"IF(Tabelle_Auswertung[[#This Row],[Platz]]=6,CONCATENATE(Tabelle_Auswertung[[#This Row],[Bildname]],\" von \",Tabelle_Auswertung[[#This Row],[Autor(in)]]),\"\")","v":""},{"$f":"IF(Tabelle_Auswertung[[#This Row],[Platz]]=7,CONCATENATE(Tabelle_Auswertung[[#This Row],[Bildname]],\" von \",Tabelle_Auswertung[[#This Row],[Autor(in)]]),\"\")","v":""},{"$f":"IF(Tabelle_Auswertung[[#This Row],[Platz]]=8,CONCATENATE(Tabelle_Auswertung[[#This Row],[Bildname]],\" von \",Tabelle_Auswertung[[#This Row],[Autor(in)]]),\"\")","v":""},{"$f":"IF(Tabelle_Auswertung[[#This Row],[Platz]]=9,CONCATENATE(Tabelle_Auswertung[[#This Row],[Bildname]],\" von \",Tabelle_Auswertung[[#This Row],[Autor(in)]]),\"\")","v":""},{"$f":"IF(Tabelle_Auswertung[[#This Row],[Platz]]=10,CONCATENATE(Tabelle_Auswertung[[#This Row],[Bildname]],\" von \",Tabelle_Auswertung[[#This Row],[Autor(in)]]),\"\")","v":""}]
[139,{"$nulls":21},{"$f":"IF(Tabelle_Auswertung[[#This Row],[Bildname]]<>\"\",\n    IF(Tabelle_Auswertung[[#This Row],[abwesend]]=\"ja\",\n        SUM(Tabelle_Auswertung[[#This Row],[Juror 1]:[Juror 20]])/COUNT(Tabelle_Auswertung[[#This Row],[Juror 1]:[Juror 20]])*(COUNT(Tabelle_Auswertung[[#This Row],[Juror 1]:[Juror 20]])-1),\n        SUM(Tabelle_Auswertung[[#This Row],[Juror 1]:[Juror 20]])\n    ),\n\" - \")","v":" - "},{"$f":"IF(Tabelle_Auswertung[[#This Row],[Bildname]]<>\"\",IF(Tabelle_Auswertung[[#This Row],[Punkte]]>0,AVERAGE(Tabelle_Auswertung[[#This Row],[Juror 1]:[Juror 20]]),\" - \"),\" - \")","v":" - "},{"$f":"IF(Tabelle_Auswertung[[#This Row],[Bildname]]<>\"\",IF(Tabelle_Auswertung[[#This Row],[Punkte]]>0,RANK(Tabelle_Auswertung[[#This Row],[Punkte]],[Punkte],0),\" - \"),\" - \")","v":" - "}," - - -",null,{"$f":"IF(Tabelle_Auswertung[[#This Row],[Platz]]=1,CONCATENATE(Tabelle_Auswertung[[#This Row],[Bildname]],\" von \",Tabelle_Auswertung[[#This Row],[Autor(in)]]),\"\")","v":""},{"$f":"IF(Tabelle_Auswertung[[#This Row],[Platz]]=2,CONCATENATE(Tabelle_Auswertung[[#This Row],[Bildname]],\" von \",Tabelle_Auswertung[[#This Row],[Autor(in)]]),\"\")","v":""},{"$f":"IF(Tabelle_Auswertung[[#This Row],[Platz]]=3,CONCATENATE(Tabelle_Auswertung[[#This Row],[Bildname]],\" von \",Tabelle_Auswertung[[#This Row],[Autor(in)]]),\"\")","v":""},{"$f":"IF(Tabelle_Auswertung[[#This Row],[Platz]]=4,CONCATENATE(Tabelle_Auswertung[[#This Row],[Bildname]],\" von \",Tabelle_Auswertung[[#This Row],[Autor(in)]]),\"\")","v":""},{"$f":"IF(Tabelle_Auswertung[[#This Row],[Platz]]=5,CONCATENATE(Tabelle_Auswertung[[#This Row],[Bildname]],\" von \",Tabelle_Auswertung[[#This Row],[Autor(in)]]),\"\")","v":""},{"$f":"IF(Tabelle_Auswertung[[#This Row],[Platz]]=6,CONCATENATE(Tabelle_Auswertung[[#This Row],[Bildname]],\" von \",Tabelle_Auswertung[[#This Row],[Autor(in)]]),\"\")","v":""},{"$f":"IF(Tabelle_Auswertung[[#This Row],[Platz]]=7,CONCATENATE(Tabelle_Auswertung[[#This Row],[Bildname]],\" von \",Tabelle_Auswertung[[#This Row],[Autor(in)]]),\"\")","v":""},{"$f":"IF(Tabelle_Auswertung[[#This Row],[Platz]]=8,CONCATENATE(Tabelle_Auswertung[[#This Row],[Bildname]],\" von \",Tabelle_Auswertung[[#This Row],[Autor(in)]]),\"\")","v":""},{"$f":"IF(Tabelle_Auswertung[[#This Row],[Platz]]=9,CONCATENATE(Tabelle_Auswertung[[#This Row],[Bildname]],\" von \",Tabelle_Auswertung[[#This Row],[Autor(in)]]),\"\")","v":""},{"$f":"IF(Tabelle_Auswertung[[#This Row],[Platz]]=10,CONCATENATE(Tabelle_Auswertung[[#This Row],[Bildname]],\" von \",Tabelle_Auswertung[[#This Row],[Autor(in)]]),\"\")","v":""}]
[140,{"$nulls":21},{"$f":"IF(Tabelle_Auswertung[[#This Row],[Bildname]]<>\"\",\n    IF(Tabelle_Auswertung[[#This Row],[abwesend]]=\"ja\",\n        SUM(Tabelle_Auswertung[[#This Row],[Juror 1]:[Juror 20]])/COUNT(Tabelle_Auswertung[[#This Row],[Juror 1]:[Juror 20]])*(COUNT(Tabelle_Auswertung[[#This Row],[Juror 1]:[Juror 20]])-1),\n        SUM(Tabelle_Auswertung[[#This Row],[Juror 1]:[Juror 20]])\n    ),\n\" - \")","v":" - "},{"$f":"IF(Tabelle_Auswertung[[#This Row],[Bildname]]<>\"\",IF(Tabelle_Auswertung[[#This Row],[Punkte]]>0,AVERAGE(Tabelle_Auswertung[[#This Row],[Juror 1]:[Juror 20]]),\" - \"),\" - \")","v":" - "},{"$f":"IF(Tabelle_Auswertung[[#This Row],[Bildname]]<>\"\",IF(Tabelle_Auswertung[[#This Row],[Punkte]]>0,RANK(Tabelle_Auswertung[[#This Row],[Punkte]],[Punkte],0),\" - \"),\" - \")","v":" - "}," - - -",null,{"$f":"IF(Tabelle_Auswertung[[#This Row],[Platz]]=1,CONCATENATE(Tabelle_Auswertung[[#This Row],[Bildname]],\" von \",Tabelle_Auswertung[[#This Row],[Autor(in)]]),\"\")","v":""},{"$f":"IF(Tabelle_Auswertung[[#This Row],[Platz]]=2,CONCATENATE(Tabelle_Auswertung[[#This Row],[Bildname]],\" von \",Tabelle_Auswertung[[#This Row],[Autor(in)]]),\"\")","v":""},{"$f":"IF(Tabelle_Auswertung[[#This Row],[Platz]]=3,CONCATENATE(Tabelle_Auswertung[[#This Row],[Bildname]],\" von \",Tabelle_Auswertung[[#This Row],[Autor(in)]]),\"\")","v":""},{"$f":"IF(Tabelle_Auswertung[[#This Row],[Platz]]=4,CONCATENATE(Tabelle_Auswertung[[#This Row],[Bildname]],\" von \",Tabelle_Auswertung[[#This Row],[Autor(in)]]),\"\")","v":""},{"$f":"IF(Tabelle_Auswertung[[#This Row],[Platz]]=5,CONCATENATE(Tabelle_Auswertung[[#This Row],[Bildname]],\" von \",Tabelle_Auswertung[[#This Row],[Autor(in)]]),\"\")","v":""},{"$f":"IF(Tabelle_Auswertung[[#This Row],[Platz]]=6,CONCATENATE(Tabelle_Auswertung[[#This Row],[Bildname]],\" von \",Tabelle_Auswertung[[#This Row],[Autor(in)]]),\"\")","v":""},{"$f":"IF(Tabelle_Auswertung[[#This Row],[Platz]]=7,CONCATENATE(Tabelle_Auswertung[[#This Row],[Bildname]],\" von \",Tabelle_Auswertung[[#This Row],[Autor(in)]]),\"\")","v":""},{"$f":"IF(Tabelle_Auswertung[[#This Row],[Platz]]=8,CONCATENATE(Tabelle_Auswertung[[#This Row],[Bildname]],\" von \",Tabelle_Auswertung[[#This Row],[Autor(in)]]),\"\")","v":""},{"$f":"IF(Tabelle_Auswertung[[#This Row],[Platz]]=9,CONCATENATE(Tabelle_Auswertung[[#This Row],[Bildname]],\" von \",Tabelle_Auswertung[[#This Row],[Autor(in)]]),\"\")","v":""},{"$f":"IF(Tabelle_Auswertung[[#This Row],[Platz]]=10,CONCATENATE(Tabelle_Auswertung[[#This Row],[Bildname]],\" von \",Tabelle_Auswertung[[#This Row],[Autor(in)]]),\"\")","v":""}]
[141,{"$nulls":21},{"$f":"IF(Tabelle_Auswertung[[#This Row],[Bildname]]<>\"\",\n    IF(Tabelle_Auswertung[[#This Row],[abwesend]]=\"ja\",\n        SUM(Tabelle_Auswertung[[#This Row],[Juror 1]:[Juror 20]])/COUNT(Tabelle_Auswertung[[#This Row],[Juror 1]:[Juror 20]])*(COUNT(Tabelle_Auswertung[[#This Row],[Juror 1]:[Juror 20]])-1),\n        SUM(Tabelle_Auswertung[[#This Row],[Juror 1]:[Juror 20]])\n    ),\n\" - \")","v":" - "},{"$f":"IF(Tabelle_Auswertung[[#This Row],[Bildname]]<>\"\",IF(Tabelle_Auswertung[[#This Row],[Punkte]]>0,AVERAGE(Tabelle_Auswertung[[#This Row],[Juror 1]:[Juror 20]]),\" - \"),\" - \")","v":" - "},{"$f":"IF(Tabelle_Auswertung[[#This Row],[Bildname]]<>\"\",IF(Tabelle_Auswertung[[#This Row],[Punkte]]>0,RANK(Tabelle_Auswertung[[#This Row],[Punkte]],[Punkte],0),\" - \"),\" - \")","v":" - "}," - - -",null,{"$f":"IF(Tabelle_Auswertung[[#This Row],[Platz]]=1,CONCATENATE(Tabelle_Auswertung[[#This Row],[Bildname]],\" von \",Tabelle_Auswertung[[#This Row],[Autor(in)]]),\"\")","v":""},{"$f":"IF(Tabelle_Auswertung[[#This Row],[Platz]]=2,CONCATENATE(Tabelle_Auswertung[[#This Row],[Bildname]],\" von \",Tabelle_Auswertung[[#This Row],[Autor(in)]]),\"\")","v":""},{"$f":"IF(Tabelle_Auswertung[[#This Row],[Platz]]=3,CONCATENATE(Tabelle_Auswertung[[#This Row],[Bildname]],\" von \",Tabelle_Auswertung[[#This Row],[Autor(in)]]),\"\")","v":""},{"$f":"IF(Tabelle_Auswertung[[#This Row],[Platz]]=4,CONCATENATE(Tabelle_Auswertung[[#This Row],[Bildname]],\" von \",Tabelle_Auswertung[[#This Row],[Autor(in)]]),\"\")","v":""},{"$f":"IF(Tabelle_Auswertung[[#This Row],[Platz]]=5,CONCATENATE(Tabelle_Auswertung[[#This Row],[Bildname]],\" von \",Tabelle_Auswertung[[#This Row],[Autor(in)]]),\"\")","v":""},{"$f":"IF(Tabelle_Auswertung[[#This Row],[Platz]]=6,CONCATENATE(Tabelle_Auswertung[[#This Row],[Bildname]],\" von \",Tabelle_Auswertung[[#This Row],[Autor(in)]]),\"\")","v":""},{"$f":"IF(Tabelle_Auswertung[[#This Row],[Platz]]=7,CONCATENATE(Tabelle_Auswertung[[#This Row],[Bildname]],\" von \",Tabelle_Auswertung[[#This Row],[Autor(in)]]),\"\")","v":""},{"$f":"IF(Tabelle_Auswertung[[#This Row],[Platz]]=8,CONCATENATE(Tabelle_Auswertung[[#This Row],[Bildname]],\" von \",Tabelle_Auswertung[[#This Row],[Autor(in)]]),\"\")","v":""},{"$f":"IF(Tabelle_Auswertung[[#This Row],[Platz]]=9,CONCATENATE(Tabelle_Auswertung[[#This Row],[Bildname]],\" von \",Tabelle_Auswertung[[#This Row],[Autor(in)]]),\"\")","v":""},{"$f":"IF(Tabelle_Auswertung[[#This Row],[Platz]]=10,CONCATENATE(Tabelle_Auswertung[[#This Row],[Bildname]],\" von \",Tabelle_Auswertung[[#This Row],[Autor(in)]]),\"\")","v":""}]
[142,{"$nulls":21},{"$f":"IF(Tabelle_Auswertung[[#This Row],[Bildname]]<>\"\",\n    IF(Tabelle_Auswertung[[#This Row],[abwesend]]=\"ja\",\n        SUM(Tabelle_Auswertung[[#This Row],[Juror 1]:[Juror 20]])/COUNT(Tabelle_Auswertung[[#This Row],[Juror 1]:[Juror 20]])*(COUNT(Tabelle_Auswertung[[#This Row],[Juror 1]:[Juror 20]])-1),\n        SUM(Tabelle_Auswertung[[#This Row],[Juror 1]:[Juror 20]])\n    ),\n\" - \")","v":" - "},{"$f":"IF(Tabelle_Auswertung[[#This Row],[Bildname]]<>\"\",IF(Tabelle_Auswertung[[#This Row],[Punkte]]>0,AVERAGE(Tabelle_Auswertung[[#This Row],[Juror 1]:[Juror 20]]),\" - \"),\" - \")","v":" - "},{"$f":"IF(Tabelle_Auswertung[[#This Row],[Bildname]]<>\"\",IF(Tabelle_Auswertung[[#This Row],[Punkte]]>0,RANK(Tabelle_Auswertung[[#This Row],[Punkte]],[Punkte],0),\" - \"),\" - \")","v":" - "}," - - -",null,{"$f":"IF(Tabelle_Auswertung[[#This Row],[Platz]]=1,CONCATENATE(Tabelle_Auswertung[[#This Row],[Bildname]],\" von \",Tabelle_Auswertung[[#This Row],[Autor(in)]]),\"\")","v":""},{"$f":"IF(Tabelle_Auswertung[[#This Row],[Platz]]=2,CONCATENATE(Tabelle_Auswertung[[#This Row],[Bildname]],\" von \",Tabelle_Auswertung[[#This Row],[Autor(in)]]),\"\")","v":""},{"$f":"IF(Tabelle_Auswertung[[#This Row],[Platz]]=3,CONCATENATE(Tabelle_Auswertung[[#This Row],[Bildname]],\" von \",Tabelle_Auswertung[[#This Row],[Autor(in)]]),\"\")","v":""},{"$f":"IF(Tabelle_Auswertung[[#This Row],[Platz]]=4,CONCATENATE(Tabelle_Auswertung[[#This Row],[Bildname]],\" von \",Tabelle_Auswertung[[#This Row],[Autor(in)]]),\"\")","v":""},{"$f":"IF(Tabelle_Auswertung[[#This Row],[Platz]]=5,CONCATENATE(Tabelle_Auswertung[[#This Row],[Bildname]],\" von \",Tabelle_Auswertung[[#This Row],[Autor(in)]]),\"\")","v":""},{"$f":"IF(Tabelle_Auswertung[[#This Row],[Platz]]=6,CONCATENATE(Tabelle_Auswertung[[#This Row],[Bildname]],\" von \",Tabelle_Auswertung[[#This Row],[Autor(in)]]),\"\")","v":""},{"$f":"IF(Tabelle_Auswertung[[#This Row],[Platz]]=7,CONCATENATE(Tabelle_Auswertung[[#This Row],[Bildname]],\" von \",Tabelle_Auswertung[[#This Row],[Autor(in)]]),\"\")","v":""},{"$f":"IF(Tabelle_Auswertung[[#This Row],[Platz]]=8,CONCATENATE(Tabelle_Auswertung[[#This Row],[Bildname]],\" von \",Tabelle_Auswertung[[#This Row],[Autor(in)]]),\"\")","v":""},{"$f":"IF(Tabelle_Auswertung[[#This Row],[Platz]]=9,CONCATENATE(Tabelle_Auswertung[[#This Row],[Bildname]],\" von \",Tabelle_Auswertung[[#This Row],[Autor(in)]]),\"\")","v":""},{"$f":"IF(Tabelle_Auswertung[[#This Row],[Platz]]=10,CONCATENATE(Tabelle_Auswertung[[#This Row],[Bildname]],\" von \",Tabelle_Auswertung[[#This Row],[Autor(in)]]),\"\")","v":""}]
[143,{"$nulls":21},{"$f":"IF(Tabelle_Auswertung[[#This Row],[Bildname]]<>\"\",\n    IF(Tabelle_Auswertung[[#This Row],[abwesend]]=\"ja\",\n        SUM(Tabelle_Auswertung[[#This Row],[Juror 1]:[Juror 20]])/COUNT(Tabelle_Auswertung[[#This Row],[Juror 1]:[Juror 20]])*(COUNT(Tabelle_Auswertung[[#This Row],[Juror 1]:[Juror 20]])-1),\n        SUM(Tabelle_Auswertung[[#This Row],[Juror 1]:[Juror 20]])\n    ),\n\" - \")","v":" - "},{"$f":"IF(Tabelle_Auswertung[[#This Row],[Bildname]]<>\"\",IF(Tabelle_Auswertung[[#This Row],[Punkte]]>0,AVERAGE(Tabelle_Auswertung[[#This Row],[Juror 1]:[Juror 20]]),\" - \"),\" - \")","v":" - "},{"$f":"IF(Tabelle_Auswertung[[#This Row],[Bildname]]<>\"\",IF(Tabelle_Auswertung[[#This Row],[Punkte]]>0,RANK(Tabelle_Auswertung[[#This Row],[Punkte]],[Punkte],0),\" - \"),\" - \")","v":" - "}," - - -",null,{"$f":"IF(Tabelle_Auswertung[[#This Row],[Platz]]=1,CONCATENATE(Tabelle_Auswertung[[#This Row],[Bildname]],\" von \",Tabelle_Auswertung[[#This Row],[Autor(in)]]),\"\")","v":""},{"$f":"IF(Tabelle_Auswertung[[#This Row],[Platz]]=2,CONCATENATE(Tabelle_Auswertung[[#This Row],[Bildname]],\" von \",Tabelle_Auswertung[[#This Row],[Autor(in)]]),\"\")","v":""},{"$f":"IF(Tabelle_Auswertung[[#This Row],[Platz]]=3,CONCATENATE(Tabelle_Auswertung[[#This Row],[Bildname]],\" von \",Tabelle_Auswertung[[#This Row],[Autor(in)]]),\"\")","v":""},{"$f":"IF(Tabelle_Auswertung[[#This Row],[Platz]]=4,CONCATENATE(Tabelle_Auswertung[[#This Row],[Bildname]],\" von \",Tabelle_Auswertung[[#This Row],[Autor(in)]]),\"\")","v":""},{"$f":"IF(Tabelle_Auswertung[[#This Row],[Platz]]=5,CONCATENATE(Tabelle_Auswertung[[#This Row],[Bildname]],\" von \",Tabelle_Auswertung[[#This Row],[Autor(in)]]),\"\")","v":""},{"$f":"IF(Tabelle_Auswertung[[#This Row],[Platz]]=6,CONCATENATE(Tabelle_Auswertung[[#This Row],[Bildname]],\" von \",Tabelle_Auswertung[[#This Row],[Autor(in)]]),\"\")","v":""},{"$f":"IF(Tabelle_Auswertung[[#This Row],[Platz]]=7,CONCATENATE(Tabelle_Auswertung[[#This Row],[Bildname]],\" von \",Tabelle_Auswertung[[#This Row],[Autor(in)]]),\"\")","v":""},{"$f":"IF(Tabelle_Auswertung[[#This Row],[Platz]]=8,CONCATENATE(Tabelle_Auswertung[[#This Row],[Bildname]],\" von \",Tabelle_Auswertung[[#This Row],[Autor(in)]]),\"\")","v":""},{"$f":"IF(Tabelle_Auswertung[[#This Row],[Platz]]=9,CONCATENATE(Tabelle_Auswertung[[#This Row],[Bildname]],\" von \",Tabelle_Auswertung[[#This Row],[Autor(in)]]),\"\")","v":""},{"$f":"IF(Tabelle_Auswertung[[#This Row],[Platz]]=10,CONCATENATE(Tabelle_Auswertung[[#This Row],[Bildname]],\" von \",Tabelle_Auswertung[[#This Row],[Autor(in)]]),\"\")","v":""}]
[144,{"$nulls":21},{"$f":"IF(Tabelle_Auswertung[[#This Row],[Bildname]]<>\"\",\n    IF(Tabelle_Auswertung[[#This Row],[abwesend]]=\"ja\",\n        SUM(Tabelle_Auswertung[[#This Row],[Juror 1]:[Juror 20]])/COUNT(Tabelle_Auswertung[[#This Row],[Juror 1]:[Juror 20]])*(COUNT(Tabelle_Auswertung[[#This Row],[Juror 1]:[Juror 20]])-1),\n        SUM(Tabelle_Auswertung[[#This Row],[Juror 1]:[Juror 20]])\n    ),\n\" - \")","v":" - "},{"$f":"IF(Tabelle_Auswertung[[#This Row],[Bildname]]<>\"\",IF(Tabelle_Auswertung[[#This Row],[Punkte]]>0,AVERAGE(Tabelle_Auswertung[[#This Row],[Juror 1]:[Juror 20]]),\" - \"),\" - \")","v":" - "},{"$f":"IF(Tabelle_Auswertung[[#This Row],[Bildname]]<>\"\",IF(Tabelle_Auswertung[[#This Row],[Punkte]]>0,RANK(Tabelle_Auswertung[[#This Row],[Punkte]],[Punkte],0),\" - \"),\" - \")","v":" - "}," - - -",null,{"$f":"IF(Tabelle_Auswertung[[#This Row],[Platz]]=1,CONCATENATE(Tabelle_Auswertung[[#This Row],[Bildname]],\" von \",Tabelle_Auswertung[[#This Row],[Autor(in)]]),\"\")","v":""},{"$f":"IF(Tabelle_Auswertung[[#This Row],[Platz]]=2,CONCATENATE(Tabelle_Auswertung[[#This Row],[Bildname]],\" von \",Tabelle_Auswertung[[#This Row],[Autor(in)]]),\"\")","v":""},{"$f":"IF(Tabelle_Auswertung[[#This Row],[Platz]]=3,CONCATENATE(Tabelle_Auswertung[[#This Row],[Bildname]],\" von \",Tabelle_Auswertung[[#This Row],[Autor(in)]]),\"\")","v":""},{"$f":"IF(Tabelle_Auswertung[[#This Row],[Platz]]=4,CONCATENATE(Tabelle_Auswertung[[#This Row],[Bildname]],\" von \",Tabelle_Auswertung[[#This Row],[Autor(in)]]),\"\")","v":""},{"$f":"IF(Tabelle_Auswertung[[#This Row],[Platz]]=5,CONCATENATE(Tabelle_Auswertung[[#This Row],[Bildname]],\" von \",Tabelle_Auswertung[[#This Row],[Autor(in)]]),\"\")","v":""},{"$f":"IF(Tabelle_Auswertung[[#This Row],[Platz]]=6,CONCATENATE(Tabelle_Auswertung[[#This Row],[Bildname]],\" von \",Tabelle_Auswertung[[#This Row],[Autor(in)]]),\"\")","v":""},{"$f":"IF(Tabelle_Auswertung[[#This Row],[Platz]]=7,CONCATENATE(Tabelle_Auswertung[[#This Row],[Bildname]],\" von \",Tabelle_Auswertung[[#This Row],[Autor(in)]]),\"\")","v":""},{"$f":"IF(Tabelle_Auswertung[[#This Row],[Platz]]=8,CONCATENATE(Tabelle_Auswertung[[#This Row],[Bildname]],\" von \",Tabelle_Auswertung[[#This Row],[Autor(in)]]),\"\")","v":""},{"$f":"IF(Tabelle_Auswertung[[#This Row],[Platz]]=9,CONCATENATE(Tabelle_Auswertung[[#This Row],[Bildname]],\" von \",Tabelle_Auswertung[[#This Row],[Autor(in)]]),\"\")","v":""},{"$f":"IF(Tabelle_Auswertung[[#This Row],[Platz]]=10,CONCATENATE(Tabelle_Auswertung[[#This Row],[Bildname]],\" von \",Tabelle_Auswertung[[#This Row],[Autor(in)]]),\"\")","v":""}]
[145,{"$nulls":21},{"$f":"IF(Tabelle_Auswertung[[#This Row],[Bildname]]<>\"\",\n    IF(Tabelle_Auswertung[[#This Row],[abwesend]]=\"ja\",\n        SUM(Tabelle_Auswertung[[#This Row],[Juror 1]:[Juror 20]])/COUNT(Tabelle_Auswertung[[#This Row],[Juror 1]:[Juror 20]])*(COUNT(Tabelle_Auswertung[[#This Row],[Juror 1]:[Juror 20]])-1),\n        SUM(Tabelle_Auswertung[[#This Row],[Juror 1]:[Juror 20]])\n    ),\n\" - \")","v":" - "},{"$f":"IF(Tabelle_Auswertung[[#This Row],[Bildname]]<>\"\",IF(Tabelle_Auswertung[[#This Row],[Punkte]]>0,AVERAGE(Tabelle_Auswertung[[#This Row],[Juror 1]:[Juror 20]]),\" - \"),\" - \")","v":" - "},{"$f":"IF(Tabelle_Auswertung[[#This Row],[Bildname]]<>\"\",IF(Tabelle_Auswertung[[#This Row],[Punkte]]>0,RANK(Tabelle_Auswertung[[#This Row],[Punkte]],[Punkte],0),\" - \"),\" - \")","v":" - "}," - - -",null,{"$f":"IF(Tabelle_Auswertung[[#This Row],[Platz]]=1,CONCATENATE(Tabelle_Auswertung[[#This Row],[Bildname]],\" von \",Tabelle_Auswertung[[#This Row],[Autor(in)]]),\"\")","v":""},{"$f":"IF(Tabelle_Auswertung[[#This Row],[Platz]]=2,CONCATENATE(Tabelle_Auswertung[[#This Row],[Bildname]],\" von \",Tabelle_Auswertung[[#This Row],[Autor(in)]]),\"\")","v":""},{"$f":"IF(Tabelle_Auswertung[[#This Row],[Platz]]=3,CONCATENATE(Tabelle_Auswertung[[#This Row],[Bildname]],\" von \",Tabelle_Auswertung[[#This Row],[Autor(in)]]),\"\")","v":""},{"$f":"IF(Tabelle_Auswertung[[#This Row],[Platz]]=4,CONCATENATE(Tabelle_Auswertung[[#This Row],[Bildname]],\" von \",Tabelle_Auswertung[[#This Row],[Autor(in)]]),\"\")","v":""},{"$f":"IF(Tabelle_Auswertung[[#This Row],[Platz]]=5,CONCATENATE(Tabelle_Auswertung[[#This Row],[Bildname]],\" von \",Tabelle_Auswertung[[#This Row],[Autor(in)]]),\"\")","v":""},{"$f":"IF(Tabelle_Auswertung[[#This Row],[Platz]]=6,CONCATENATE(Tabelle_Auswertung[[#This Row],[Bildname]],\" von \",Tabelle_Auswertung[[#This Row],[Autor(in)]]),\"\")","v":""},{"$f":"IF(Tabelle_Auswertung[[#This Row],[Platz]]=7,CONCATENATE(Tabelle_Auswertung[[#This Row],[Bildname]],\" von \",Tabelle_Auswertung[[#This Row],[Autor(in)]]),\"\")","v":""},{"$f":"IF(Tabelle_Auswertung[[#This Row],[Platz]]=8,CONCATENATE(Tabelle_Auswertung[[#This Row],[Bildname]],\" von \",Tabelle_Auswertung[[#This Row],[Autor(in)]]),\"\")","v":""},{"$f":"IF(Tabelle_Auswertung[[#This Row],[Platz]]=9,CONCATENATE(Tabelle_Auswertung[[#This Row],[Bildname]],\" von \",Tabelle_Auswertung[[#This Row],[Autor(in)]]),\"\")","v":""},{"$f":"IF(Tabelle_Auswertung[[#This Row],[Platz]]=10,CONCATENATE(Tabelle_Auswertung[[#This Row],[Bildname]],\" von \",Tabelle_Auswertung[[#This Row],[Autor(in)]]),\"\")","v":""}]
[146,{"$nulls":21},{"$f":"IF(Tabelle_Auswertung[[#This Row],[Bildname]]<>\"\",\n    IF(Tabelle_Auswertung[[#This Row],[abwesend]]=\"ja\",\n        SUM(Tabelle_Auswertung[[#This Row],[Juror 1]:[Juror 20]])/COUNT(Tabelle_Auswertung[[#This Row],[Juror 1]:[Juror 20]])*(COUNT(Tabelle_Auswertung[[#This Row],[Juror 1]:[Juror 20]])-1),\n        SUM(Tabelle_Auswertung[[#This Row],[Juror 1]:[Juror 20]])\n    ),\n\" - \")","v":" - "},{"$f":"IF(Tabelle_Auswertung[[#This Row],[Bildname]]<>\"\",IF(Tabelle_Auswertung[[#This Row],[Punkte]]>0,AVERAGE(Tabelle_Auswertung[[#This Row],[Juror 1]:[Juror 20]]),\" - \"),\" - \")","v":" - "},{"$f":"IF(Tabelle_Auswertung[[#This Row],[Bildname]]<>\"\",IF(Tabelle_Auswertung[[#This Row],[Punkte]]>0,RANK(Tabelle_Auswertung[[#This Row],[Punkte]],[Punkte],0),\" - \"),\" - \")","v":" - "}," - - -",null,{"$f":"IF(Tabelle_Auswertung[[#This Row],[Platz]]=1,CONCATENATE(Tabelle_Auswertung[[#This Row],[Bildname]],\" von \",Tabelle_Auswertung[[#This Row],[Autor(in)]]),\"\")","v":""},{"$f":"IF(Tabelle_Auswertung[[#This Row],[Platz]]=2,CONCATENATE(Tabelle_Auswertung[[#This Row],[Bildname]],\" von \",Tabelle_Auswertung[[#This Row],[Autor(in)]]),\"\")","v":""},{"$f":"IF(Tabelle_Auswertung[[#This Row],[Platz]]=3,CONCATENATE(Tabelle_Auswertung[[#This Row],[Bildname]],\" von \",Tabelle_Auswertung[[#This Row],[Autor(in)]]),\"\")","v":""},{"$f":"IF(Tabelle_Auswertung[[#This Row],[Platz]]=4,CONCATENATE(Tabelle_Auswertung[[#This Row],[Bildname]],\" von \",Tabelle_Auswertung[[#This Row],[Autor(in)]]),\"\")","v":""},{"$f":"IF(Tabelle_Auswertung[[#This Row],[Platz]]=5,CONCATENATE(Tabelle_Auswertung[[#This Row],[Bildname]],\" von \",Tabelle_Auswertung[[#This Row],[Autor(in)]]),\"\")","v":""},{"$f":"IF(Tabelle_Auswertung[[#This Row],[Platz]]=6,CONCATENATE(Tabelle_Auswertung[[#This Row],[Bildname]],\" von \",Tabelle_Auswertung[[#This Row],[Autor(in)]]),\"\")","v":""},{"$f":"IF(Tabelle_Auswertung[[#This Row],[Platz]]=7,CONCATENATE(Tabelle_Auswertung[[#This Row],[Bildname]],\" von \",Tabelle_Auswertung[[#This Row],[Autor(in)]]),\"\")","v":""},{"$f":"IF(Tabelle_Auswertung[[#This Row],[Platz]]=8,CONCATENATE(Tabelle_Auswertung[[#This Row],[Bildname]],\" von \",Tabelle_Auswertung[[#This Row],[Autor(in)]]),\"\")","v":""},{"$f":"IF(Tabelle_Auswertung[[#This Row],[Platz]]=9,CONCATENATE(Tabelle_Auswertung[[#This Row],[Bildname]],\" von \",Tabelle_Auswertung[[#This Row],[Autor(in)]]),\"\")","v":""},{"$f":"IF(Tabelle_Auswertung[[#This Row],[Platz]]=10,CONCATENATE(Tabelle_Auswertung[[#This Row],[Bildname]],\" von \",Tabelle_Auswertung[[#This Row],[Autor(in)]]),\"\")","v":""}]
[147,{"$nulls":21},{"$f":"IF(Tabelle_Auswertung[[#This Row],[Bildname]]<>\"\",\n    IF(Tabelle_Auswertung[[#This Row],[abwesend]]=\"ja\",\n        SUM(Tabelle_Auswertung[[#This Row],[Juror 1]:[Juror 20]])/COUNT(Tabelle_Auswertung[[#This Row],[Juror 1]:[Juror 20]])*(COUNT(Tabelle_Auswertung[[#This Row],[Juror 1]:[Juror 20]])-1),\n        SUM(Tabelle_Auswertung[[#This Row],[Juror 1]:[Juror 20]])\n    ),\n\" - \")","v":" - "},{"$f":"IF(Tabelle_Auswertung[[#This Row],[Bildname]]<>\"\",IF(Tabelle_Auswertung[[#This Row],[Punkte]]>0,AVERAGE(Tabelle_Auswertung[[#This Row],[Juror 1]:[Juror 20]]),\" - \"),\" - \")","v":" - "},{"$f":"IF(Tabelle_Auswertung[[#This Row],[Bildname]]<>\"\",IF(Tabelle_Auswertung[[#This Row],[Punkte]]>0,RANK(Tabelle_Auswertung[[#This Row],[Punkte]],[Punkte],0),\" - \"),\" - \")","v":" - "}," - - -",null,{"$f":"IF(Tabelle_Auswertung[[#This Row],[Platz]]=1,CONCATENATE(Tabelle_Auswertung[[#This Row],[Bildname]],\" von \",Tabelle_Auswertung[[#This Row],[Autor(in)]]),\"\")","v":""},{"$f":"IF(Tabelle_Auswertung[[#This Row],[Platz]]=2,CONCATENATE(Tabelle_Auswertung[[#This Row],[Bildname]],\" von \",Tabelle_Auswertung[[#This Row],[Autor(in)]]),\"\")","v":""},{"$f":"IF(Tabelle_Auswertung[[#This Row],[Platz]]=3,CONCATENATE(Tabelle_Auswertung[[#This Row],[Bildname]],\" von \",Tabelle_Auswertung[[#This Row],[Autor(in)]]),\"\")","v":""},{"$f":"IF(Tabelle_Auswertung[[#This Row],[Platz]]=4,CONCATENATE(Tabelle_Auswertung[[#This Row],[Bildname]],\" von \",Tabelle_Auswertung[[#This Row],[Autor(in)]]),\"\")","v":""},{"$f":"IF(Tabelle_Auswertung[[#This Row],[Platz]]=5,CONCATENATE(Tabelle_Auswertung[[#This Row],[Bildname]],\" von \",Tabelle_Auswertung[[#This Row],[Autor(in)]]),\"\")","v":""},{"$f":"IF(Tabelle_Auswertung[[#This Row],[Platz]]=6,CONCATENATE(Tabelle_Auswertung[[#This Row],[Bildname]],\" von \",Tabelle_Auswertung[[#This Row],[Autor(in)]]),\"\")","v":""},{"$f":"IF(Tabelle_Auswertung[[#This Row],[Platz]]=7,CONCATENATE(Tabelle_Auswertung[[#This Row],[Bildname]],\" von \",Tabelle_Auswertung[[#This Row],[Autor(in)]]),\"\")","v":""},{"$f":"IF(Tabelle_Auswertung[[#This Row],[Platz]]=8,CONCATENATE(Tabelle_Auswertung[[#This Row],[Bildname]],\" von \",Tabelle_Auswertung[[#This Row],[Autor(in)]]),\"\")","v":""},{"$f":"IF(Tabelle_Auswertung[[#This Row],[Platz]]=9,CONCATENATE(Tabelle_Auswertung[[#This Row],[Bildname]],\" von \",Tabelle_Auswertung[[#This Row],[Autor(in)]]),\"\")","v":""},{"$f":"IF(Tabelle_Auswertung[[#This Row],[Platz]]=10,CONCATENATE(Tabelle_Auswertung[[#This Row],[Bildname]],\" von \",Tabelle_Auswertung[[#This Row],[Autor(in)]]),\"\")","v":""}]
[148,{"$nulls":21},{"$f":"IF(Tabelle_Auswertung[[#This Row],[Bildname]]<>\"\",\n    IF(Tabelle_Auswertung[[#This Row],[abwesend]]=\"ja\",\n        SUM(Tabelle_Auswertung[[#This Row],[Juror 1]:[Juror 20]])/COUNT(Tabelle_Auswertung[[#This Row],[Juror 1]:[Juror 20]])*(COUNT(Tabelle_Auswertung[[#This Row],[Juror 1]:[Juror 20]])-1),\n        SUM(Tabelle_Auswertung[[#This Row],[Juror 1]:[Juror 20]])\n    ),\n\" - \")","v":" - "},{"$f":"IF(Tabelle_Auswertung[[#This Row],[Bildname]]<>\"\",IF(Tabelle_Auswertung[[#This Row],[Punkte]]>0,AVERAGE(Tabelle_Auswertung[[#This Row],[Juror 1]:[Juror 20]]),\" - \"),\" - \")","v":" - "},{"$f":"IF(Tabelle_Auswertung[[#This Row],[Bildname]]<>\"\",IF(Tabelle_Auswertung[[#This Row],[Punkte]]>0,RANK(Tabelle_Auswertung[[#This Row],[Punkte]],[Punkte],0),\" - \"),\" - \")","v":" - "}," - - -",null,{"$f":"IF(Tabelle_Auswertung[[#This Row],[Platz]]=1,CONCATENATE(Tabelle_Auswertung[[#This Row],[Bildname]],\" von \",Tabelle_Auswertung[[#This Row],[Autor(in)]]),\"\")","v":""},{"$f":"IF(Tabelle_Auswertung[[#This Row],[Platz]]=2,CONCATENATE(Tabelle_Auswertung[[#This Row],[Bildname]],\" von \",Tabelle_Auswertung[[#This Row],[Autor(in)]]),\"\")","v":""},{"$f":"IF(Tabelle_Auswertung[[#This Row],[Platz]]=3,CONCATENATE(Tabelle_Auswertung[[#This Row],[Bildname]],\" von \",Tabelle_Auswertung[[#This Row],[Autor(in)]]),\"\")","v":""},{"$f":"IF(Tabelle_Auswertung[[#This Row],[Platz]]=4,CONCATENATE(Tabelle_Auswertung[[#This Row],[Bildname]],\" von \",Tabelle_Auswertung[[#This Row],[Autor(in)]]),\"\")","v":""},{"$f":"IF(Tabelle_Auswertung[[#This Row],[Platz]]=5,CONCATENATE(Tabelle_Auswertung[[#This Row],[Bildname]],\" von \",Tabelle_Auswertung[[#This Row],[Autor(in)]]),\"\")","v":""},{"$f":"IF(Tabelle_Auswertung[[#This Row],[Platz]]=6,CONCATENATE(Tabelle_Auswertung[[#This Row],[Bildname]],\" von \",Tabelle_Auswertung[[#This Row],[Autor(in)]]),\"\")","v":""},{"$f":"IF(Tabelle_Auswertung[[#This Row],[Platz]]=7,CONCATENATE(Tabelle_Auswertung[[#This Row],[Bildname]],\" von \",Tabelle_Auswertung[[#This Row],[Autor(in)]]),\"\")","v":""},{"$f":"IF(Tabelle_Auswertung[[#This Row],[Platz]]=8,CONCATENATE(Tabelle_Auswertung[[#This Row],[Bildname]],\" von \",Tabelle_Auswertung[[#This Row],[Autor(in)]]),\"\")","v":""},{"$f":"IF(Tabelle_Auswertung[[#This Row],[Platz]]=9,CONCATENATE(Tabelle_Auswertung[[#This Row],[Bildname]],\" von \",Tabelle_Auswertung[[#This Row],[Autor(in)]]),\"\")","v":""},{"$f":"IF(Tabelle_Auswertung[[#This Row],[Platz]]=10,CONCATENATE(Tabelle_Auswertung[[#This Row],[Bildname]],\" von \",Tabelle_Auswertung[[#This Row],[Autor(in)]]),\"\")","v":""}]
[149,{"$nulls":21},{"$f":"IF(Tabelle_Auswertung[[#This Row],[Bildname]]<>\"\",\n    IF(Tabelle_Auswertung[[#This Row],[abwesend]]=\"ja\",\n        SUM(Tabelle_Auswertung[[#This Row],[Juror 1]:[Juror 20]])/COUNT(Tabelle_Auswertung[[#This Row],[Juror 1]:[Juror 20]])*(COUNT(Tabelle_Auswertung[[#This Row],[Juror 1]:[Juror 20]])-1),\n        SUM(Tabelle_Auswertung[[#This Row],[Juror 1]:[Juror 20]])\n    ),\n\" - \")","v":" - "},{"$f":"IF(Tabelle_Auswertung[[#This Row],[Bildname]]<>\"\",IF(Tabelle_Auswertung[[#This Row],[Punkte]]>0,AVERAGE(Tabelle_Auswertung[[#This Row],[Juror 1]:[Juror 20]]),\" - \"),\" - \")","v":" - "},{"$f":"IF(Tabelle_Auswertung[[#This Row],[Bildname]]<>\"\",IF(Tabelle_Auswertung[[#This Row],[Punkte]]>0,RANK(Tabelle_Auswertung[[#This Row],[Punkte]],[Punkte],0),\" - \"),\" - \")","v":" - "}," - - -",null,{"$f":"IF(Tabelle_Auswertung[[#This Row],[Platz]]=1,CONCATENATE(Tabelle_Auswertung[[#This Row],[Bildname]],\" von \",Tabelle_Auswertung[[#This Row],[Autor(in)]]),\"\")","v":""},{"$f":"IF(Tabelle_Auswertung[[#This Row],[Platz]]=2,CONCATENATE(Tabelle_Auswertung[[#This Row],[Bildname]],\" von \",Tabelle_Auswertung[[#This Row],[Autor(in)]]),\"\")","v":""},{"$f":"IF(Tabelle_Auswertung[[#This Row],[Platz]]=3,CONCATENATE(Tabelle_Auswertung[[#This Row],[Bildname]],\" von \",Tabelle_Auswertung[[#This Row],[Autor(in)]]),\"\")","v":""},{"$f":"IF(Tabelle_Auswertung[[#This Row],[Platz]]=4,CONCATENATE(Tabelle_Auswertung[[#This Row],[Bildname]],\" von \",Tabelle_Auswertung[[#This Row],[Autor(in)]]),\"\")","v":""},{"$f":"IF(Tabelle_Auswertung[[#This Row],[Platz]]=5,CONCATENATE(Tabelle_Auswertung[[#This Row],[Bildname]],\" von \",Tabelle_Auswertung[[#This Row],[Autor(in)]]),\"\")","v":""},{"$f":"IF(Tabelle_Auswertung[[#This Row],[Platz]]=6,CONCATENATE(Tabelle_Auswertung[[#This Row],[Bildname]],\" von \",Tabelle_Auswertung[[#This Row],[Autor(in)]]),\"\")","v":""},{"$f":"IF(Tabelle_Auswertung[[#This Row],[Platz]]=7,CONCATENATE(Tabelle_Auswertung[[#This Row],[Bildname]],\" von \",Tabelle_Auswertung[[#This Row],[Autor(in)]]),\"\")","v":""},{"$f":"IF(Tabelle_Auswertung[[#This Row],[Platz]]=8,CONCATENATE(Tabelle_Auswertung[[#This Row],[Bildname]],\" von \",Tabelle_Auswertung[[#This Row],[Autor(in)]]),\"\")","v":""},{"$f":"IF(Tabelle_Auswertung[[#This Row],[Platz]]=9,CONCATENATE(Tabelle_Auswertung[[#This Row],[Bildname]],\" von \",Tabelle_Auswertung[[#This Row],[Autor(in)]]),\"\")","v":""},{"$f":"IF(Tabelle_Auswertung[[#This Row],[Platz]]=10,CONCATENATE(Tabelle_Auswertung[[#This Row],[Bildname]],\" von \",Tabelle_Auswertung[[#This Row],[Autor(in)]]),\"\")","v":""}]
[150,{"$nulls":21},{"$f":"IF(Tabelle_Auswertung[[#This Row],[Bildname]]<>\"\",\n    IF(Tabelle_Auswertung[[#This Row],[abwesend]]=\"ja\",\n        SUM(Tabelle_Auswertung[[#This Row],[Juror 1]:[Juror 20]])/COUNT(Tabelle_Auswertung[[#This Row],[Juror 1]:[Juror 20]])*(COUNT(Tabelle_Auswertung[[#This Row],[Juror 1]:[Juror 20]])-1),\n        SUM(Tabelle_Auswertung[[#This Row],[Juror 1]:[Juror 20]])\n    ),\n\" - \")","v":" - "},{"$f":"IF(Tabelle_Auswertung[[#This Row],[Bildname]]<>\"\",IF(Tabelle_Auswertung[[#This Row],[Punkte]]>0,AVERAGE(Tabelle_Auswertung[[#This Row],[Juror 1]:[Juror 20]]),\" - \"),\" - \")","v":" - "},{"$f":"IF(Tabelle_Auswertung[[#This Row],[Bildname]]<>\"\",IF(Tabelle_Auswertung[[#This Row],[Punkte]]>0,RANK(Tabelle_Auswertung[[#This Row],[Punkte]],[Punkte],0),\" - \"),\" - \")","v":" - "}," - - -",null,{"$f":"IF(Tabelle_Auswertung[[#This Row],[Platz]]=1,CONCATENATE(Tabelle_Auswertung[[#This Row],[Bildname]],\" von \",Tabelle_Auswertung[[#This Row],[Autor(in)]]),\"\")","v":""},{"$f":"IF(Tabelle_Auswertung[[#This Row],[Platz]]=2,CONCATENATE(Tabelle_Auswertung[[#This Row],[Bildname]],\" von \",Tabelle_Auswertung[[#This Row],[Autor(in)]]),\"\")","v":""},{"$f":"IF(Tabelle_Auswertung[[#This Row],[Platz]]=3,CONCATENATE(Tabelle_Auswertung[[#This Row],[Bildname]],\" von \",Tabelle_Auswertung[[#This Row],[Autor(in)]]),\"\")","v":""},{"$f":"IF(Tabelle_Auswertung[[#This Row],[Platz]]=4,CONCATENATE(Tabelle_Auswertung[[#This Row],[Bildname]],\" von \",Tabelle_Auswertung[[#This Row],[Autor(in)]]),\"\")","v":""},{"$f":"IF(Tabelle_Auswertung[[#This Row],[Platz]]=5,CONCATENATE(Tabelle_Auswertung[[#This Row],[Bildname]],\" von \",Tabelle_Auswertung[[#This Row],[Autor(in)]]),\"\")","v":""},{"$f":"IF(Tabelle_Auswertung[[#This Row],[Platz]]=6,CONCATENATE(Tabelle_Auswertung[[#This Row],[Bildname]],\" von \",Tabelle_Auswertung[[#This Row],[Autor(in)]]),\"\")","v":""},{"$f":"IF(Tabelle_Auswertung[[#This Row],[Platz]]=7,CONCATENATE(Tabelle_Auswertung[[#This Row],[Bildname]],\" von \",Tabelle_Auswertung[[#This Row],[Autor(in)]]),\"\")","v":""},{"$f":"IF(Tabelle_Auswertung[[#This Row],[Platz]]=8,CONCATENATE(Tabelle_Auswertung[[#This Row],[Bildname]],\" von \",Tabelle_Auswertung[[#This Row],[Autor(in)]]),\"\")","v":""},{"$f":"IF(Tabelle_Auswertung[[#This Row],[Platz]]=9,CONCATENATE(Tabelle_Auswertung[[#This Row],[Bildname]],\" von \",Tabelle_Auswertung[[#This Row],[Autor(in)]]),\"\")","v":""},{"$f":"IF(Tabelle_Auswertung[[#This Row],[Platz]]=10,CONCATENATE(Tabelle_Auswertung[[#This Row],[Bildname]],\" von \",Tabelle_Auswertung[[#This Row],[Autor(in)]]),\"\")","v":""}]
[151,{"$nulls":21},{"$f":"IF(Tabelle_Auswertung[[#This Row],[Bildname]]<>\"\",\n    IF(Tabelle_Auswertung[[#This Row],[abwesend]]=\"ja\",\n        SUM(Tabelle_Auswertung[[#This Row],[Juror 1]:[Juror 20]])/COUNT(Tabelle_Auswertung[[#This Row],[Juror 1]:[Juror 20]])*(COUNT(Tabelle_Auswertung[[#This Row],[Juror 1]:[Juror 20]])-1),\n        SUM(Tabelle_Auswertung[[#This Row],[Juror 1]:[Juror 20]])\n    ),\n\" - \")","v":" - "},{"$f":"IF(Tabelle_Auswertung[[#This Row],[Bildname]]<>\"\",IF(Tabelle_Auswertung[[#This Row],[Punkte]]>0,AVERAGE(Tabelle_Auswertung[[#This Row],[Juror 1]:[Juror 20]]),\" - \"),\" - \")","v":" - "},{"$f":"IF(Tabelle_Auswertung[[#This Row],[Bildname]]<>\"\",IF(Tabelle_Auswertung[[#This Row],[Punkte]]>0,RANK(Tabelle_Auswertung[[#This Row],[Punkte]],[Punkte],0),\" - \"),\" - \")","v":" - "}," - - -",null,{"$f":"IF(Tabelle_Auswertung[[#This Row],[Platz]]=1,CONCATENATE(Tabelle_Auswertung[[#This Row],[Bildname]],\" von \",Tabelle_Auswertung[[#This Row],[Autor(in)]]),\"\")","v":""},{"$f":"IF(Tabelle_Auswertung[[#This Row],[Platz]]=2,CONCATENATE(Tabelle_Auswertung[[#This Row],[Bildname]],\" von \",Tabelle_Auswertung[[#This Row],[Autor(in)]]),\"\")","v":""},{"$f":"IF(Tabelle_Auswertung[[#This Row],[Platz]]=3,CONCATENATE(Tabelle_Auswertung[[#This Row],[Bildname]],\" von \",Tabelle_Auswertung[[#This Row],[Autor(in)]]),\"\")","v":""},{"$f":"IF(Tabelle_Auswertung[[#This Row],[Platz]]=4,CONCATENATE(Tabelle_Auswertung[[#This Row],[Bildname]],\" von \",Tabelle_Auswertung[[#This Row],[Autor(in)]]),\"\")","v":""},{"$f":"IF(Tabelle_Auswertung[[#This Row],[Platz]]=5,CONCATENATE(Tabelle_Auswertung[[#This Row],[Bildname]],\" von \",Tabelle_Auswertung[[#This Row],[Autor(in)]]),\"\")","v":""},{"$f":"IF(Tabelle_Auswertung[[#This Row],[Platz]]=6,CONCATENATE(Tabelle_Auswertung[[#This Row],[Bildname]],\" von \",Tabelle_Auswertung[[#This Row],[Autor(in)]]),\"\")","v":""},{"$f":"IF(Tabelle_Auswertung[[#This Row],[Platz]]=7,CONCATENATE(Tabelle_Auswertung[[#This Row],[Bildname]],\" von \",Tabelle_Auswertung[[#This Row],[Autor(in)]]),\"\")","v":""},{"$f":"IF(Tabelle_Auswertung[[#This Row],[Platz]]=8,CONCATENATE(Tabelle_Auswertung[[#This Row],[Bildname]],\" von \",Tabelle_Auswertung[[#This Row],[Autor(in)]]),\"\")","v":""},{"$f":"IF(Tabelle_Auswertung[[#This Row],[Platz]]=9,CONCATENATE(Tabelle_Auswertung[[#This Row],[Bildname]],\" von \",Tabelle_Auswertung[[#This Row],[Autor(in)]]),\"\")","v":""},{"$f":"IF(Tabelle_Auswertung[[#This Row],[Platz]]=10,CONCATENATE(Tabelle_Auswertung[[#This Row],[Bildname]],\" von \",Tabelle_Auswertung[[#This Row],[Autor(in)]]),\"\")","v":""}]
[152,{"$nulls":21},{"$f":"IF(Tabelle_Auswertung[[#This Row],[Bildname]]<>\"\",\n    IF(Tabelle_Auswertung[[#This Row],[abwesend]]=\"ja\",\n        SUM(Tabelle_Auswertung[[#This Row],[Juror 1]:[Juror 20]])/COUNT(Tabelle_Auswertung[[#This Row],[Juror 1]:[Juror 20]])*(COUNT(Tabelle_Auswertung[[#This Row],[Juror 1]:[Juror 20]])-1),\n        SUM(Tabelle_Auswertung[[#This Row],[Juror 1]:[Juror 20]])\n    ),\n\" - \")","v":" - "},{"$f":"IF(Tabelle_Auswertung[[#This Row],[Bildname]]<>\"\",IF(Tabelle_Auswertung[[#This Row],[Punkte]]>0,AVERAGE(Tabelle_Auswertung[[#This Row],[Juror 1]:[Juror 20]]),\" - \"),\" - \")","v":" - "},{"$f":"IF(Tabelle_Auswertung[[#This Row],[Bildname]]<>\"\",IF(Tabelle_Auswertung[[#This Row],[Punkte]]>0,RANK(Tabelle_Auswertung[[#This Row],[Punkte]],[Punkte],0),\" - \"),\" - \")","v":" - "}," - - -",null,{"$f":"IF(Tabelle_Auswertung[[#This Row],[Platz]]=1,CONCATENATE(Tabelle_Auswertung[[#This Row],[Bildname]],\" von \",Tabelle_Auswertung[[#This Row],[Autor(in)]]),\"\")","v":""},{"$f":"IF(Tabelle_Auswertung[[#This Row],[Platz]]=2,CONCATENATE(Tabelle_Auswertung[[#This Row],[Bildname]],\" von \",Tabelle_Auswertung[[#This Row],[Autor(in)]]),\"\")","v":""},{"$f":"IF(Tabelle_Auswertung[[#This Row],[Platz]]=3,CONCATENATE(Tabelle_Auswertung[[#This Row],[Bildname]],\" von \",Tabelle_Auswertung[[#This Row],[Autor(in)]]),\"\")","v":""},{"$f":"IF(Tabelle_Auswertung[[#This Row],[Platz]]=4,CONCATENATE(Tabelle_Auswertung[[#This Row],[Bildname]],\" von \",Tabelle_Auswertung[[#This Row],[Autor(in)]]),\"\")","v":""},{"$f":"IF(Tabelle_Auswertung[[#This Row],[Platz]]=5,CONCATENATE(Tabelle_Auswertung[[#This Row],[Bildname]],\" von \",Tabelle_Auswertung[[#This Row],[Autor(in)]]),\"\")","v":""},{"$f":"IF(Tabelle_Auswertung[[#This Row],[Platz]]=6,CONCATENATE(Tabelle_Auswertung[[#This Row],[Bildname]],\" von \",Tabelle_Auswertung[[#This Row],[Autor(in)]]),\"\")","v":""},{"$f":"IF(Tabelle_Auswertung[[#This Row],[Platz]]=7,CONCATENATE(Tabelle_Auswertung[[#This Row],[Bildname]],\" von \",Tabelle_Auswertung[[#This Row],[Autor(in)]]),\"\")","v":""},{"$f":"IF(Tabelle_Auswertung[[#This Row],[Platz]]=8,CONCATENATE(Tabelle_Auswertung[[#This Row],[Bildname]],\" von \",Tabelle_Auswertung[[#This Row],[Autor(in)]]),\"\")","v":""},{"$f":"IF(Tabelle_Auswertung[[#This Row],[Platz]]=9,CONCATENATE(Tabelle_Auswertung[[#This Row],[Bildname]],\" von \",Tabelle_Auswertung[[#This Row],[Autor(in)]]),\"\")","v":""},{"$f":"IF(Tabelle_Auswertung[[#This Row],[Platz]]=10,CONCATENATE(Tabelle_Auswertung[[#This Row],[Bildname]],\" von \",Tabelle_Auswertung[[#This Row],[Autor(in)]]),\"\")","v":""}]
[153,{"$nulls":21},{"$f":"IF(Tabelle_Auswertung[[#This Row],[Bildname]]<>\"\",\n    IF(Tabelle_Auswertung[[#This Row],[abwesend]]=\"ja\",\n        SUM(Tabelle_Auswertung[[#This Row],[Juror 1]:[Juror 20]])/COUNT(Tabelle_Auswertung[[#This Row],[Juror 1]:[Juror 20]])*(COUNT(Tabelle_Auswertung[[#This Row],[Juror 1]:[Juror 20]])-1),\n        SUM(Tabelle_Auswertung[[#This Row],[Juror 1]:[Juror 20]])\n    ),\n\" - \")","v":" - "},{"$f":"IF(Tabelle_Auswertung[[#This Row],[Bildname]]<>\"\",IF(Tabelle_Auswertung[[#This Row],[Punkte]]>0,AVERAGE(Tabelle_Auswertung[[#This Row],[Juror 1]:[Juror 20]]),\" - \"),\" - \")","v":" - "},{"$f":"IF(Tabelle_Auswertung[[#This Row],[Bildname]]<>\"\",IF(Tabelle_Auswertung[[#This Row],[Punkte]]>0,RANK(Tabelle_Auswertung[[#This Row],[Punkte]],[Punkte],0),\" - \"),\" - \")","v":" - "}," - - -",null,{"$f":"IF(Tabelle_Auswertung[[#This Row],[Platz]]=1,CONCATENATE(Tabelle_Auswertung[[#This Row],[Bildname]],\" von \",Tabelle_Auswertung[[#This Row],[Autor(in)]]),\"\")","v":""},{"$f":"IF(Tabelle_Auswertung[[#This Row],[Platz]]=2,CONCATENATE(Tabelle_Auswertung[[#This Row],[Bildname]],\" von \",Tabelle_Auswertung[[#This Row],[Autor(in)]]),\"\")","v":""},{"$f":"IF(Tabelle_Auswertung[[#This Row],[Platz]]=3,CONCATENATE(Tabelle_Auswertung[[#This Row],[Bildname]],\" von \",Tabelle_Auswertung[[#This Row],[Autor(in)]]),\"\")","v":""},{"$f":"IF(Tabelle_Auswertung[[#This Row],[Platz]]=4,CONCATENATE(Tabelle_Auswertung[[#This Row],[Bildname]],\" von \",Tabelle_Auswertung[[#This Row],[Autor(in)]]),\"\")","v":""},{"$f":"IF(Tabelle_Auswertung[[#This Row],[Platz]]=5,CONCATENATE(Tabelle_Auswertung[[#This Row],[Bildname]],\" von \",Tabelle_Auswertung[[#This Row],[Autor(in)]]),\"\")","v":""},{"$f":"IF(Tabelle_Auswertung[[#This Row],[Platz]]=6,CONCATENATE(Tabelle_Auswertung[[#This Row],[Bildname]],\" von \",Tabelle_Auswertung[[#This Row],[Autor(in)]]),\"\")","v":""},{"$f":"IF(Tabelle_Auswertung[[#This Row],[Platz]]=7,CONCATENATE(Tabelle_Auswertung[[#This Row],[Bildname]],\" von \",Tabelle_Auswertung[[#This Row],[Autor(in)]]),\"\")","v":""},{"$f":"IF(Tabelle_Auswertung[[#This Row],[Platz]]=8,CONCATENATE(Tabelle_Auswertung[[#This Row],[Bildname]],\" von \",Tabelle_Auswertung[[#This Row],[Autor(in)]]),\"\")","v":""},{"$f":"IF(Tabelle_Auswertung[[#This Row],[Platz]]=9,CONCATENATE(Tabelle_Auswertung[[#This Row],[Bildname]],\" von \",Tabelle_Auswertung[[#This Row],[Autor(in)]]),\"\")","v":""},{"$f":"IF(Tabelle_Auswertung[[#This Row],[Platz]]=10,CONCATENATE(Tabelle_Auswertung[[#This Row],[Bildname]],\" von \",Tabelle_Auswertung[[#This Row],[Autor(in)]]),\"\")","v":""}]
[154,{"$nulls":21},{"$f":"IF(Tabelle_Auswertung[[#This Row],[Bildname]]<>\"\",\n    IF(Tabelle_Auswertung[[#This Row],[abwesend]]=\"ja\",\n        SUM(Tabelle_Auswertung[[#This Row],[Juror 1]:[Juror 20]])/COUNT(Tabelle_Auswertung[[#This Row],[Juror 1]:[Juror 20]])*(COUNT(Tabelle_Auswertung[[#This Row],[Juror 1]:[Juror 20]])-1),\n        SUM(Tabelle_Auswertung[[#This Row],[Juror 1]:[Juror 20]])\n    ),\n\" - \")","v":" - "},{"$f":"IF(Tabelle_Auswertung[[#This Row],[Bildname]]<>\"\",IF(Tabelle_Auswertung[[#This Row],[Punkte]]>0,AVERAGE(Tabelle_Auswertung[[#This Row],[Juror 1]:[Juror 20]]),\" - \"),\" - \")","v":" - "},{"$f":"IF(Tabelle_Auswertung[[#This Row],[Bildname]]<>\"\",IF(Tabelle_Auswertung[[#This Row],[Punkte]]>0,RANK(Tabelle_Auswertung[[#This Row],[Punkte]],[Punkte],0),\" - \"),\" - \")","v":" - "}," - - -",null,{"$f":"IF(Tabelle_Auswertung[[#This Row],[Platz]]=1,CONCATENATE(Tabelle_Auswertung[[#This Row],[Bildname]],\" von \",Tabelle_Auswertung[[#This Row],[Autor(in)]]),\"\")","v":""},{"$f":"IF(Tabelle_Auswertung[[#This Row],[Platz]]=2,CONCATENATE(Tabelle_Auswertung[[#This Row],[Bildname]],\" von \",Tabelle_Auswertung[[#This Row],[Autor(in)]]),\"\")","v":""},{"$f":"IF(Tabelle_Auswertung[[#This Row],[Platz]]=3,CONCATENATE(Tabelle_Auswertung[[#This Row],[Bildname]],\" von \",Tabelle_Auswertung[[#This Row],[Autor(in)]]),\"\")","v":""},{"$f":"IF(Tabelle_Auswertung[[#This Row],[Platz]]=4,CONCATENATE(Tabelle_Auswertung[[#This Row],[Bildname]],\" von \",Tabelle_Auswertung[[#This Row],[Autor(in)]]),\"\")","v":""},{"$f":"IF(Tabelle_Auswertung[[#This Row],[Platz]]=5,CONCATENATE(Tabelle_Auswertung[[#This Row],[Bildname]],\" von \",Tabelle_Auswertung[[#This Row],[Autor(in)]]),\"\")","v":""},{"$f":"IF(Tabelle_Auswertung[[#This Row],[Platz]]=6,CONCATENATE(Tabelle_Auswertung[[#This Row],[Bildname]],\" von \",Tabelle_Auswertung[[#This Row],[Autor(in)]]),\"\")","v":""},{"$f":"IF(Tabelle_Auswertung[[#This Row],[Platz]]=7,CONCATENATE(Tabelle_Auswertung[[#This Row],[Bildname]],\" von \",Tabelle_Auswertung[[#This Row],[Autor(in)]]),\"\")","v":""},{"$f":"IF(Tabelle_Auswertung[[#This Row],[Platz]]=8,CONCATENATE(Tabelle_Auswertung[[#This Row],[Bildname]],\" von \",Tabelle_Auswertung[[#This Row],[Autor(in)]]),\"\")","v":""},{"$f":"IF(Tabelle_Auswertung[[#This Row],[Platz]]=9,CONCATENATE(Tabelle_Auswertung[[#This Row],[Bildname]],\" von \",Tabelle_Auswertung[[#This Row],[Autor(in)]]),\"\")","v":""},{"$f":"IF(Tabelle_Auswertung[[#This Row],[Platz]]=10,CONCATENATE(Tabelle_Auswertung[[#This Row],[Bildname]],\" von \",Tabelle_Auswertung[[#This Row],[Autor(in)]]),\"\")","v":""}]
[155,{"$nulls":21},{"$f":"IF(Tabelle_Auswertung[[#This Row],[Bildname]]<>\"\",\n    IF(Tabelle_Auswertung[[#This Row],[abwesend]]=\"ja\",\n        SUM(Tabelle_Auswertung[[#This Row],[Juror 1]:[Juror 20]])/COUNT(Tabelle_Auswertung[[#This Row],[Juror 1]:[Juror 20]])*(COUNT(Tabelle_Auswertung[[#This Row],[Juror 1]:[Juror 20]])-1),\n        SUM(Tabelle_Auswertung[[#This Row],[Juror 1]:[Juror 20]])\n    ),\n\" - \")","v":" - "},{"$f":"IF(Tabelle_Auswertung[[#This Row],[Bildname]]<>\"\",IF(Tabelle_Auswertung[[#This Row],[Punkte]]>0,AVERAGE(Tabelle_Auswertung[[#This Row],[Juror 1]:[Juror 20]]),\" - \"),\" - \")","v":" - "},{"$f":"IF(Tabelle_Auswertung[[#This Row],[Bildname]]<>\"\",IF(Tabelle_Auswertung[[#This Row],[Punkte]]>0,RANK(Tabelle_Auswertung[[#This Row],[Punkte]],[Punkte],0),\" - \"),\" - \")","v":" - "}," - - -",null,{"$f":"IF(Tabelle_Auswertung[[#This Row],[Platz]]=1,CONCATENATE(Tabelle_Auswertung[[#This Row],[Bildname]],\" von \",Tabelle_Auswertung[[#This Row],[Autor(in)]]),\"\")","v":""},{"$f":"IF(Tabelle_Auswertung[[#This Row],[Platz]]=2,CONCATENATE(Tabelle_Auswertung[[#This Row],[Bildname]],\" von \",Tabelle_Auswertung[[#This Row],[Autor(in)]]),\"\")","v":""},{"$f":"IF(Tabelle_Auswertung[[#This Row],[Platz]]=3,CONCATENATE(Tabelle_Auswertung[[#This Row],[Bildname]],\" von \",Tabelle_Auswertung[[#This Row],[Autor(in)]]),\"\")","v":""},{"$f":"IF(Tabelle_Auswertung[[#This Row],[Platz]]=4,CONCATENATE(Tabelle_Auswertung[[#This Row],[Bildname]],\" von \",Tabelle_Auswertung[[#This Row],[Autor(in)]]),\"\")","v":""},{"$f":"IF(Tabelle_Auswertung[[#This Row],[Platz]]=5,CONCATENATE(Tabelle_Auswertung[[#This Row],[Bildname]],\" von \",Tabelle_Auswertung[[#This Row],[Autor(in)]]),\"\")","v":""},{"$f":"IF(Tabelle_Auswertung[[#This Row],[Platz]]=6,CONCATENATE(Tabelle_Auswertung[[#This Row],[Bildname]],\" von \",Tabelle_Auswertung[[#This Row],[Autor(in)]]),\"\")","v":""},{"$f":"IF(Tabelle_Auswertung[[#This Row],[Platz]]=7,CONCATENATE(Tabelle_Auswertung[[#This Row],[Bildname]],\" von \",Tabelle_Auswertung[[#This Row],[Autor(in)]]),\"\")","v":""},{"$f":"IF(Tabelle_Auswertung[[#This Row],[Platz]]=8,CONCATENATE(Tabelle_Auswertung[[#This Row],[Bildname]],\" von \",Tabelle_Auswertung[[#This Row],[Autor(in)]]),\"\")","v":""},{"$f":"IF(Tabelle_Auswertung[[#This Row],[Platz]]=9,CONCATENATE(Tabelle_Auswertung[[#This Row],[Bildname]],\" von \",Tabelle_Auswertung[[#This Row],[Autor(in)]]),\"\")","v":""},{"$f":"IF(Tabelle_Auswertung[[#This Row],[Platz]]=10,CONCATENATE(Tabelle_Auswertung[[#This Row],[Bildname]],\" von \",Tabelle_Auswertung[[#This Row],[Autor(in)]]),\"\")","v":""}]
[156,{"$nulls":21},{"$f":"IF(Tabelle_Auswertung[[#This Row],[Bildname]]<>\"\",\n    IF(Tabelle_Auswertung[[#This Row],[abwesend]]=\"ja\",\n        SUM(Tabelle_Auswertung[[#This Row],[Juror 1]:[Juror 20]])/COUNT(Tabelle_Auswertung[[#This Row],[Juror 1]:[Juror 20]])*(COUNT(Tabelle_Auswertung[[#This Row],[Juror 1]:[Juror 20]])-1),\n        SUM(Tabelle_Auswertung[[#This Row],[Juror 1]:[Juror 20]])\n    ),\n\" - \")","v":" - "},{"$f":"IF(Tabelle_Auswertung[[#This Row],[Bildname]]<>\"\",IF(Tabelle_Auswertung[[#This Row],[Punkte]]>0,AVERAGE(Tabelle_Auswertung[[#This Row],[Juror 1]:[Juror 20]]),\" - \"),\" - \")","v":" - "},{"$f":"IF(Tabelle_Auswertung[[#This Row],[Bildname]]<>\"\",IF(Tabelle_Auswertung[[#This Row],[Punkte]]>0,RANK(Tabelle_Auswertung[[#This Row],[Punkte]],[Punkte],0),\" - \"),\" - \")","v":" - "}," - - -",null,{"$f":"IF(Tabelle_Auswertung[[#This Row],[Platz]]=1,CONCATENATE(Tabelle_Auswertung[[#This Row],[Bildname]],\" von \",Tabelle_Auswertung[[#This Row],[Autor(in)]]),\"\")","v":""},{"$f":"IF(Tabelle_Auswertung[[#This Row],[Platz]]=2,CONCATENATE(Tabelle_Auswertung[[#This Row],[Bildname]],\" von \",Tabelle_Auswertung[[#This Row],[Autor(in)]]),\"\")","v":""},{"$f":"IF(Tabelle_Auswertung[[#This Row],[Platz]]=3,CONCATENATE(Tabelle_Auswertung[[#This Row],[Bildname]],\" von \",Tabelle_Auswertung[[#This Row],[Autor(in)]]),\"\")","v":""},{"$f":"IF(Tabelle_Auswertung[[#This Row],[Platz]]=4,CONCATENATE(Tabelle_Auswertung[[#This Row],[Bildname]],\" von \",Tabelle_Auswertung[[#This Row],[Autor(in)]]),\"\")","v":""},{"$f":"IF(Tabelle_Auswertung[[#This Row],[Platz]]=5,CONCATENATE(Tabelle_Auswertung[[#This Row],[Bildname]],\" von \",Tabelle_Auswertung[[#This Row],[Autor(in)]]),\"\")","v":""},{"$f":"IF(Tabelle_Auswertung[[#This Row],[Platz]]=6,CONCATENATE(Tabelle_Auswertung[[#This Row],[Bildname]],\" von \",Tabelle_Auswertung[[#This Row],[Autor(in)]]),\"\")","v":""},{"$f":"IF(Tabelle_Auswertung[[#This Row],[Platz]]=7,CONCATENATE(Tabelle_Auswertung[[#This Row],[Bildname]],\" von \",Tabelle_Auswertung[[#This Row],[Autor(in)]]),\"\")","v":""},{"$f":"IF(Tabelle_Auswertung[[#This Row],[Platz]]=8,CONCATENATE(Tabelle_Auswertung[[#This Row],[Bildname]],\" von \",Tabelle_Auswertung[[#This Row],[Autor(in)]]),\"\")","v":""},{"$f":"IF(Tabelle_Auswertung[[#This Row],[Platz]]=9,CONCATENATE(Tabelle_Auswertung[[#This Row],[Bildname]],\" von \",Tabelle_Auswertung[[#This Row],[Autor(in)]]),\"\")","v":""},{"$f":"IF(Tabelle_Auswertung[[#This Row],[Platz]]=10,CONCATENATE(Tabelle_Auswertung[[#This Row],[Bildname]],\" von \",Tabelle_Auswertung[[#This Row],[Autor(in)]]),\"\")","v":""}]
[157,{"$nulls":21},{"$f":"IF(Tabelle_Auswertung[[#This Row],[Bildname]]<>\"\",\n    IF(Tabelle_Auswertung[[#This Row],[abwesend]]=\"ja\",\n        SUM(Tabelle_Auswertung[[#This Row],[Juror 1]:[Juror 20]])/COUNT(Tabelle_Auswertung[[#This Row],[Juror 1]:[Juror 20]])*(COUNT(Tabelle_Auswertung[[#This Row],[Juror 1]:[Juror 20]])-1),\n        SUM(Tabelle_Auswertung[[#This Row],[Juror 1]:[Juror 20]])\n    ),\n\" - \")","v":" - "},{"$f":"IF(Tabelle_Auswertung[[#This Row],[Bildname]]<>\"\",IF(Tabelle_Auswertung[[#This Row],[Punkte]]>0,AVERAGE(Tabelle_Auswertung[[#This Row],[Juror 1]:[Juror 20]]),\" - \"),\" - \")","v":" - "},{"$f":"IF(Tabelle_Auswertung[[#This Row],[Bildname]]<>\"\",IF(Tabelle_Auswertung[[#This Row],[Punkte]]>0,RANK(Tabelle_Auswertung[[#This Row],[Punkte]],[Punkte],0),\" - \"),\" - \")","v":" - "}," - - -",null,{"$f":"IF(Tabelle_Auswertung[[#This Row],[Platz]]=1,CONCATENATE(Tabelle_Auswertung[[#This Row],[Bildname]],\" von \",Tabelle_Auswertung[[#This Row],[Autor(in)]]),\"\")","v":""},{"$f":"IF(Tabelle_Auswertung[[#This Row],[Platz]]=2,CONCATENATE(Tabelle_Auswertung[[#This Row],[Bildname]],\" von \",Tabelle_Auswertung[[#This Row],[Autor(in)]]),\"\")","v":""},{"$f":"IF(Tabelle_Auswertung[[#This Row],[Platz]]=3,CONCATENATE(Tabelle_Auswertung[[#This Row],[Bildname]],\" von \",Tabelle_Auswertung[[#This Row],[Autor(in)]]),\"\")","v":""},{"$f":"IF(Tabelle_Auswertung[[#This Row],[Platz]]=4,CONCATENATE(Tabelle_Auswertung[[#This Row],[Bildname]],\" von \",Tabelle_Auswertung[[#This Row],[Autor(in)]]),\"\")","v":""},{"$f":"IF(Tabelle_Auswertung[[#This Row],[Platz]]=5,CONCATENATE(Tabelle_Auswertung[[#This Row],[Bildname]],\" von \",Tabelle_Auswertung[[#This Row],[Autor(in)]]),\"\")","v":""},{"$f":"IF(Tabelle_Auswertung[[#This Row],[Platz]]=6,CONCATENATE(Tabelle_Auswertung[[#This Row],[Bildname]],\" von \",Tabelle_Auswertung[[#This Row],[Autor(in)]]),\"\")","v":""},{"$f":"IF(Tabelle_Auswertung[[#This Row],[Platz]]=7,CONCATENATE(Tabelle_Auswertung[[#This Row],[Bildname]],\" von \",Tabelle_Auswertung[[#This Row],[Autor(in)]]),\"\")","v":""},{"$f":"IF(Tabelle_Auswertung[[#This Row],[Platz]]=8,CONCATENATE(Tabelle_Auswertung[[#This Row],[Bildname]],\" von \",Tabelle_Auswertung[[#This Row],[Autor(in)]]),\"\")","v":""},{"$f":"IF(Tabelle_Auswertung[[#This Row],[Platz]]=9,CONCATENATE(Tabelle_Auswertung[[#This Row],[Bildname]],\" von \",Tabelle_Auswertung[[#This Row],[Autor(in)]]),\"\")","v":""},{"$f":"IF(Tabelle_Auswertung[[#This Row],[Platz]]=10,CONCATENATE(Tabelle_Auswertung[[#This Row],[Bildname]],\" von \",Tabelle_Auswertung[[#This Row],[Autor(in)]]),\"\")","v":""}]
[158,{"$nulls":21},{"$f":"IF(Tabelle_Auswertung[[#This Row],[Bildname]]<>\"\",\n    IF(Tabelle_Auswertung[[#This Row],[abwesend]]=\"ja\",\n        SUM(Tabelle_Auswertung[[#This Row],[Juror 1]:[Juror 20]])/COUNT(Tabelle_Auswertung[[#This Row],[Juror 1]:[Juror 20]])*(COUNT(Tabelle_Auswertung[[#This Row],[Juror 1]:[Juror 20]])-1),\n        SUM(Tabelle_Auswertung[[#This Row],[Juror 1]:[Juror 20]])\n    ),\n\" - \")","v":" - "},{"$f":"IF(Tabelle_Auswertung[[#This Row],[Bildname]]<>\"\",IF(Tabelle_Auswertung[[#This Row],[Punkte]]>0,AVERAGE(Tabelle_Auswertung[[#This Row],[Juror 1]:[Juror 20]]),\" - \"),\" - \")","v":" - "},{"$f":"IF(Tabelle_Auswertung[[#This Row],[Bildname]]<>\"\",IF(Tabelle_Auswertung[[#This Row],[Punkte]]>0,RANK(Tabelle_Auswertung[[#This Row],[Punkte]],[Punkte],0),\" - \"),\" - \")","v":" - "}," - - -",null,{"$f":"IF(Tabelle_Auswertung[[#This Row],[Platz]]=1,CONCATENATE(Tabelle_Auswertung[[#This Row],[Bildname]],\" von \",Tabelle_Auswertung[[#This Row],[Autor(in)]]),\"\")","v":""},{"$f":"IF(Tabelle_Auswertung[[#This Row],[Platz]]=2,CONCATENATE(Tabelle_Auswertung[[#This Row],[Bildname]],\" von \",Tabelle_Auswertung[[#This Row],[Autor(in)]]),\"\")","v":""},{"$f":"IF(Tabelle_Auswertung[[#This Row],[Platz]]=3,CONCATENATE(Tabelle_Auswertung[[#This Row],[Bildname]],\" von \",Tabelle_Auswertung[[#This Row],[Autor(in)]]),\"\")","v":""},{"$f":"IF(Tabelle_Auswertung[[#This Row],[Platz]]=4,CONCATENATE(Tabelle_Auswertung[[#This Row],[Bildname]],\" von \",Tabelle_Auswertung[[#This Row],[Autor(in)]]),\"\")","v":""},{"$f":"IF(Tabelle_Auswertung[[#This Row],[Platz]]=5,CONCATENATE(Tabelle_Auswertung[[#This Row],[Bildname]],\" von \",Tabelle_Auswertung[[#This Row],[Autor(in)]]),\"\")","v":""},{"$f":"IF(Tabelle_Auswertung[[#This Row],[Platz]]=6,CONCATENATE(Tabelle_Auswertung[[#This Row],[Bildname]],\" von \",Tabelle_Auswertung[[#This Row],[Autor(in)]]),\"\")","v":""},{"$f":"IF(Tabelle_Auswertung[[#This Row],[Platz]]=7,CONCATENATE(Tabelle_Auswertung[[#This Row],[Bildname]],\" von \",Tabelle_Auswertung[[#This Row],[Autor(in)]]),\"\")","v":""},{"$f":"IF(Tabelle_Auswertung[[#This Row],[Platz]]=8,CONCATENATE(Tabelle_Auswertung[[#This Row],[Bildname]],\" von \",Tabelle_Auswertung[[#This Row],[Autor(in)]]),\"\")","v":""},{"$f":"IF(Tabelle_Auswertung[[#This Row],[Platz]]=9,CONCATENATE(Tabelle_Auswertung[[#This Row],[Bildname]],\" von \",Tabelle_Auswertung[[#This Row],[Autor(in)]]),\"\")","v":""},{"$f":"IF(Tabelle_Auswertung[[#This Row],[Platz]]=10,CONCATENATE(Tabelle_Auswertung[[#This Row],[Bildname]],\" von \",Tabelle_Auswertung[[#This Row],[Autor(in)]]),\"\")","v":""}]
[159,{"$nulls":21},{"$f":"IF(Tabelle_Auswertung[[#This Row],[Bildname]]<>\"\",\n    IF(Tabelle_Auswertung[[#This Row],[abwesend]]=\"ja\",\n        SUM(Tabelle_Auswertung[[#This Row],[Juror 1]:[Juror 20]])/COUNT(Tabelle_Auswertung[[#This Row],[Juror 1]:[Juror 20]])*(COUNT(Tabelle_Auswertung[[#This Row],[Juror 1]:[Juror 20]])-1),\n        SUM(Tabelle_Auswertung[[#This Row],[Juror 1]:[Juror 20]])\n    ),\n\" - \")","v":" - "},{"$f":"IF(Tabelle_Auswertung[[#This Row],[Bildname]]<>\"\",IF(Tabelle_Auswertung[[#This Row],[Punkte]]>0,AVERAGE(Tabelle_Auswertung[[#This Row],[Juror 1]:[Juror 20]]),\" - \"),\" - \")","v":" - "},{"$f":"IF(Tabelle_Auswertung[[#This Row],[Bildname]]<>\"\",IF(Tabelle_Auswertung[[#This Row],[Punkte]]>0,RANK(Tabelle_Auswertung[[#This Row],[Punkte]],[Punkte],0),\" - \"),\" - \")","v":" - "}," - - -",null,{"$f":"IF(Tabelle_Auswertung[[#This Row],[Platz]]=1,CONCATENATE(Tabelle_Auswertung[[#This Row],[Bildname]],\" von \",Tabelle_Auswertung[[#This Row],[Autor(in)]]),\"\")","v":""},{"$f":"IF(Tabelle_Auswertung[[#This Row],[Platz]]=2,CONCATENATE(Tabelle_Auswertung[[#This Row],[Bildname]],\" von \",Tabelle_Auswertung[[#This Row],[Autor(in)]]),\"\")","v":""},{"$f":"IF(Tabelle_Auswertung[[#This Row],[Platz]]=3,CONCATENATE(Tabelle_Auswertung[[#This Row],[Bildname]],\" von \",Tabelle_Auswertung[[#This Row],[Autor(in)]]),\"\")","v":""},{"$f":"IF(Tabelle_Auswertung[[#This Row],[Platz]]=4,CONCATENATE(Tabelle_Auswertung[[#This Row],[Bildname]],\" von \",Tabelle_Auswertung[[#This Row],[Autor(in)]]),\"\")","v":""},{"$f":"IF(Tabelle_Auswertung[[#This Row],[Platz]]=5,CONCATENATE(Tabelle_Auswertung[[#This Row],[Bildname]],\" von \",Tabelle_Auswertung[[#This Row],[Autor(in)]]),\"\")","v":""},{"$f":"IF(Tabelle_Auswertung[[#This Row],[Platz]]=6,CONCATENATE(Tabelle_Auswertung[[#This Row],[Bildname]],\" von \",Tabelle_Auswertung[[#This Row],[Autor(in)]]),\"\")","v":""},{"$f":"IF(Tabelle_Auswertung[[#This Row],[Platz]]=7,CONCATENATE(Tabelle_Auswertung[[#This Row],[Bildname]],\" von \",Tabelle_Auswertung[[#This Row],[Autor(in)]]),\"\")","v":""},{"$f":"IF(Tabelle_Auswertung[[#This Row],[Platz]]=8,CONCATENATE(Tabelle_Auswertung[[#This Row],[Bildname]],\" von \",Tabelle_Auswertung[[#This Row],[Autor(in)]]),\"\")","v":""},{"$f":"IF(Tabelle_Auswertung[[#This Row],[Platz]]=9,CONCATENATE(Tabelle_Auswertung[[#This Row],[Bildname]],\" von \",Tabelle_Auswertung[[#This Row],[Autor(in)]]),\"\")","v":""},{"$f":"IF(Tabelle_Auswertung[[#This Row],[Platz]]=10,CONCATENATE(Tabelle_Auswertung[[#This Row],[Bildname]],\" von \",Tabelle_Auswertung[[#This Row],[Autor(in)]]),\"\")","v":""}]
[160,{"$nulls":21},{"$f":"IF(Tabelle_Auswertung[[#This Row],[Bildname]]<>\"\",\n    IF(Tabelle_Auswertung[[#This Row],[abwesend]]=\"ja\",\n        SUM(Tabelle_Auswertung[[#This Row],[Juror 1]:[Juror 20]])/COUNT(Tabelle_Auswertung[[#This Row],[Juror 1]:[Juror 20]])*(COUNT(Tabelle_Auswertung[[#This Row],[Juror 1]:[Juror 20]])-1),\n        SUM(Tabelle_Auswertung[[#This Row],[Juror 1]:[Juror 20]])\n    ),\n\" - \")","v":" - "},{"$f":"IF(Tabelle_Auswertung[[#This Row],[Bildname]]<>\"\",IF(Tabelle_Auswertung[[#This Row],[Punkte]]>0,AVERAGE(Tabelle_Auswertung[[#This Row],[Juror 1]:[Juror 20]]),\" - \"),\" - \")","v":" - "},{"$f":"IF(Tabelle_Auswertung[[#This Row],[Bildname]]<>\"\",IF(Tabelle_Auswertung[[#This Row],[Punkte]]>0,RANK(Tabelle_Auswertung[[#This Row],[Punkte]],[Punkte],0),\" - \"),\" - \")","v":" - "}," - - -",null,{"$f":"IF(Tabelle_Auswertung[[#This Row],[Platz]]=1,CONCATENATE(Tabelle_Auswertung[[#This Row],[Bildname]],\" von \",Tabelle_Auswertung[[#This Row],[Autor(in)]]),\"\")","v":""},{"$f":"IF(Tabelle_Auswertung[[#This Row],[Platz]]=2,CONCATENATE(Tabelle_Auswertung[[#This Row],[Bildname]],\" von \",Tabelle_Auswertung[[#This Row],[Autor(in)]]),\"\")","v":""},{"$f":"IF(Tabelle_Auswertung[[#This Row],[Platz]]=3,CONCATENATE(Tabelle_Auswertung[[#This Row],[Bildname]],\" von \",Tabelle_Auswertung[[#This Row],[Autor(in)]]),\"\")","v":""},{"$f":"IF(Tabelle_Auswertung[[#This Row],[Platz]]=4,CONCATENATE(Tabelle_Auswertung[[#This Row],[Bildname]],\" von \",Tabelle_Auswertung[[#This Row],[Autor(in)]]),\"\")","v":""},{"$f":"IF(Tabelle_Auswertung[[#This Row],[Platz]]=5,CONCATENATE(Tabelle_Auswertung[[#This Row],[Bildname]],\" von \",Tabelle_Auswertung[[#This Row],[Autor(in)]]),\"\")","v":""},{"$f":"IF(Tabelle_Auswertung[[#This Row],[Platz]]=6,CONCATENATE(Tabelle_Auswertung[[#This Row],[Bildname]],\" von \",Tabelle_Auswertung[[#This Row],[Autor(in)]]),\"\")","v":""},{"$f":"IF(Tabelle_Auswertung[[#This Row],[Platz]]=7,CONCATENATE(Tabelle_Auswertung[[#This Row],[Bildname]],\" von \",Tabelle_Auswertung[[#This Row],[Autor(in)]]),\"\")","v":""},{"$f":"IF(Tabelle_Auswertung[[#This Row],[Platz]]=8,CONCATENATE(Tabelle_Auswertung[[#This Row],[Bildname]],\" von \",Tabelle_Auswertung[[#This Row],[Autor(in)]]),\"\")","v":""},{"$f":"IF(Tabelle_Auswertung[[#This Row],[Platz]]=9,CONCATENATE(Tabelle_Auswertung[[#This Row],[Bildname]],\" von \",Tabelle_Auswertung[[#This Row],[Autor(in)]]),\"\")","v":""},{"$f":"IF(Tabelle_Auswertung[[#This Row],[Platz]]=10,CONCATENATE(Tabelle_Auswertung[[#This Row],[Bildname]],\" von \",Tabelle_Auswertung[[#This Row],[Autor(in)]]),\"\")","v":""}]
[161,{"$nulls":21},{"$f":"IF(Tabelle_Auswertung[[#This Row],[Bildname]]<>\"\",\n    IF(Tabelle_Auswertung[[#This Row],[abwesend]]=\"ja\",\n        SUM(Tabelle_Auswertung[[#This Row],[Juror 1]:[Juror 20]])/COUNT(Tabelle_Auswertung[[#This Row],[Juror 1]:[Juror 20]])*(COUNT(Tabelle_Auswertung[[#This Row],[Juror 1]:[Juror 20]])-1),\n        SUM(Tabelle_Auswertung[[#This Row],[Juror 1]:[Juror 20]])\n    ),\n\" - \")","v":" - "},{"$f":"IF(Tabelle_Auswertung[[#This Row],[Bildname]]<>\"\",IF(Tabelle_Auswertung[[#This Row],[Punkte]]>0,AVERAGE(Tabelle_Auswertung[[#This Row],[Juror 1]:[Juror 20]]),\" - \"),\" - \")","v":" - "},{"$f":"IF(Tabelle_Auswertung[[#This Row],[Bildname]]<>\"\",IF(Tabelle_Auswertung[[#This Row],[Punkte]]>0,RANK(Tabelle_Auswertung[[#This Row],[Punkte]],[Punkte],0),\" - \"),\" - \")","v":" - "}," - - -",null,{"$f":"IF(Tabelle_Auswertung[[#This Row],[Platz]]=1,CONCATENATE(Tabelle_Auswertung[[#This Row],[Bildname]],\" von \",Tabelle_Auswertung[[#This Row],[Autor(in)]]),\"\")","v":""},{"$f":"IF(Tabelle_Auswertung[[#This Row],[Platz]]=2,CONCATENATE(Tabelle_Auswertung[[#This Row],[Bildname]],\" von \",Tabelle_Auswertung[[#This Row],[Autor(in)]]),\"\")","v":""},{"$f":"IF(Tabelle_Auswertung[[#This Row],[Platz]]=3,CONCATENATE(Tabelle_Auswertung[[#This Row],[Bildname]],\" von \",Tabelle_Auswertung[[#This Row],[Autor(in)]]),\"\")","v":""},{"$f":"IF(Tabelle_Auswertung[[#This Row],[Platz]]=4,CONCATENATE(Tabelle_Auswertung[[#This Row],[Bildname]],\" von \",Tabelle_Auswertung[[#This Row],[Autor(in)]]),\"\")","v":""},{"$f":"IF(Tabelle_Auswertung[[#This Row],[Platz]]=5,CONCATENATE(Tabelle_Auswertung[[#This Row],[Bildname]],\" von \",Tabelle_Auswertung[[#This Row],[Autor(in)]]),\"\")","v":""},{"$f":"IF(Tabelle_Auswertung[[#This Row],[Platz]]=6,CONCATENATE(Tabelle_Auswertung[[#This Row],[Bildname]],\" von \",Tabelle_Auswertung[[#This Row],[Autor(in)]]),\"\")","v":""},{"$f":"IF(Tabelle_Auswertung[[#This Row],[Platz]]=7,CONCATENATE(Tabelle_Auswertung[[#This Row],[Bildname]],\" von \",Tabelle_Auswertung[[#This Row],[Autor(in)]]),\"\")","v":""},{"$f":"IF(Tabelle_Auswertung[[#This Row],[Platz]]=8,CONCATENATE(Tabelle_Auswertung[[#This Row],[Bildname]],\" von \",Tabelle_Auswertung[[#This Row],[Autor(in)]]),\"\")","v":""},{"$f":"IF(Tabelle_Auswertung[[#This Row],[Platz]]=9,CONCATENATE(Tabelle_Auswertung[[#This Row],[Bildname]],\" von \",Tabelle_Auswertung[[#This Row],[Autor(in)]]),\"\")","v":""},{"$f":"IF(Tabelle_Auswertung[[#This Row],[Platz]]=10,CONCATENATE(Tabelle_Auswertung[[#This Row],[Bildname]],\" von \",Tabelle_Auswertung[[#This Row],[Autor(in)]]),\"\")","v":""}]
[162,{"$nulls":21},{"$f":"IF(Tabelle_Auswertung[[#This Row],[Bildname]]<>\"\",\n    IF(Tabelle_Auswertung[[#This Row],[abwesend]]=\"ja\",\n        SUM(Tabelle_Auswertung[[#This Row],[Juror 1]:[Juror 20]])/COUNT(Tabelle_Auswertung[[#This Row],[Juror 1]:[Juror 20]])*(COUNT(Tabelle_Auswertung[[#This Row],[Juror 1]:[Juror 20]])-1),\n        SUM(Tabelle_Auswertung[[#This Row],[Juror 1]:[Juror 20]])\n    ),\n\" - \")","v":" - "},{"$f":"IF(Tabelle_Auswertung[[#This Row],[Bildname]]<>\"\",IF(Tabelle_Auswertung[[#This Row],[Punkte]]>0,AVERAGE(Tabelle_Auswertung[[#This Row],[Juror 1]:[Juror 20]]),\" - \"),\" - \")","v":" - "},{"$f":"IF(Tabelle_Auswertung[[#This Row],[Bildname]]<>\"\",IF(Tabelle_Auswertung[[#This Row],[Punkte]]>0,RANK(Tabelle_Auswertung[[#This Row],[Punkte]],[Punkte],0),\" - \"),\" - \")","v":" - "}," - - -",null,{"$f":"IF(Tabelle_Auswertung[[#This Row],[Platz]]=1,CONCATENATE(Tabelle_Auswertung[[#This Row],[Bildname]],\" von \",Tabelle_Auswertung[[#This Row],[Autor(in)]]),\"\")","v":""},{"$f":"IF(Tabelle_Auswertung[[#This Row],[Platz]]=2,CONCATENATE(Tabelle_Auswertung[[#This Row],[Bildname]],\" von \",Tabelle_Auswertung[[#This Row],[Autor(in)]]),\"\")","v":""},{"$f":"IF(Tabelle_Auswertung[[#This Row],[Platz]]=3,CONCATENATE(Tabelle_Auswertung[[#This Row],[Bildname]],\" von \",Tabelle_Auswertung[[#This Row],[Autor(in)]]),\"\")","v":""},{"$f":"IF(Tabelle_Auswertung[[#This Row],[Platz]]=4,CONCATENATE(Tabelle_Auswertung[[#This Row],[Bildname]],\" von \",Tabelle_Auswertung[[#This Row],[Autor(in)]]),\"\")","v":""},{"$f":"IF(Tabelle_Auswertung[[#This Row],[Platz]]=5,CONCATENATE(Tabelle_Auswertung[[#This Row],[Bildname]],\" von \",Tabelle_Auswertung[[#This Row],[Autor(in)]]),\"\")","v":""},{"$f":"IF(Tabelle_Auswertung[[#This Row],[Platz]]=6,CONCATENATE(Tabelle_Auswertung[[#This Row],[Bildname]],\" von \",Tabelle_Auswertung[[#This Row],[Autor(in)]]),\"\")","v":""},{"$f":"IF(Tabelle_Auswertung[[#This Row],[Platz]]=7,CONCATENATE(Tabelle_Auswertung[[#This Row],[Bildname]],\" von \",Tabelle_Auswertung[[#This Row],[Autor(in)]]),\"\")","v":""},{"$f":"IF(Tabelle_Auswertung[[#This Row],[Platz]]=8,CONCATENATE(Tabelle_Auswertung[[#This Row],[Bildname]],\" von \",Tabelle_Auswertung[[#This Row],[Autor(in)]]),\"\")","v":""},{"$f":"IF(Tabelle_Auswertung[[#This Row],[Platz]]=9,CONCATENATE(Tabelle_Auswertung[[#This Row],[Bildname]],\" von \",Tabelle_Auswertung[[#This Row],[Autor(in)]]),\"\")","v":""},{"$f":"IF(Tabelle_Auswertung[[#This Row],[Platz]]=10,CONCATENATE(Tabelle_Auswertung[[#This Row],[Bildname]],\" von \",Tabelle_Auswertung[[#This Row],[Autor(in)]]),\"\")","v":""}]
[163,{"$nulls":21},{"$f":"IF(Tabelle_Auswertung[[#This Row],[Bildname]]<>\"\",\n    IF(Tabelle_Auswertung[[#This Row],[abwesend]]=\"ja\",\n        SUM(Tabelle_Auswertung[[#This Row],[Juror 1]:[Juror 20]])/COUNT(Tabelle_Auswertung[[#This Row],[Juror 1]:[Juror 20]])*(COUNT(Tabelle_Auswertung[[#This Row],[Juror 1]:[Juror 20]])-1),\n        SUM(Tabelle_Auswertung[[#This Row],[Juror 1]:[Juror 20]])\n    ),\n\" - \")","v":" - "},{"$f":"IF(Tabelle_Auswertung[[#This Row],[Bildname]]<>\"\",IF(Tabelle_Auswertung[[#This Row],[Punkte]]>0,AVERAGE(Tabelle_Auswertung[[#This Row],[Juror 1]:[Juror 20]]),\" - \"),\" - \")","v":" - "},{"$f":"IF(Tabelle_Auswertung[[#This Row],[Bildname]]<>\"\",IF(Tabelle_Auswertung[[#This Row],[Punkte]]>0,RANK(Tabelle_Auswertung[[#This Row],[Punkte]],[Punkte],0),\" - \"),\" - \")","v":" - "}," - - -",null,{"$f":"IF(Tabelle_Auswertung[[#This Row],[Platz]]=1,CONCATENATE(Tabelle_Auswertung[[#This Row],[Bildname]],\" von \",Tabelle_Auswertung[[#This Row],[Autor(in)]]),\"\")","v":""},{"$f":"IF(Tabelle_Auswertung[[#This Row],[Platz]]=2,CONCATENATE(Tabelle_Auswertung[[#This Row],[Bildname]],\" von \",Tabelle_Auswertung[[#This Row],[Autor(in)]]),\"\")","v":""},{"$f":"IF(Tabelle_Auswertung[[#This Row],[Platz]]=3,CONCATENATE(Tabelle_Auswertung[[#This Row],[Bildname]],\" von \",Tabelle_Auswertung[[#This Row],[Autor(in)]]),\"\")","v":""},{"$f":"IF(Tabelle_Auswertung[[#This Row],[Platz]]=4,CONCATENATE(Tabelle_Auswertung[[#This Row],[Bildname]],\" von \",Tabelle_Auswertung[[#This Row],[Autor(in)]]),\"\")","v":""},{"$f":"IF(Tabelle_Auswertung[[#This Row],[Platz]]=5,CONCATENATE(Tabelle_Auswertung[[#This Row],[Bildname]],\" von \",Tabelle_Auswertung[[#This Row],[Autor(in)]]),\"\")","v":""},{"$f":"IF(Tabelle_Auswertung[[#This Row],[Platz]]=6,CONCATENATE(Tabelle_Auswertung[[#This Row],[Bildname]],\" von \",Tabelle_Auswertung[[#This Row],[Autor(in)]]),\"\")","v":""},{"$f":"IF(Tabelle_Auswertung[[#This Row],[Platz]]=7,CONCATENATE(Tabelle_Auswertung[[#This Row],[Bildname]],\" von \",Tabelle_Auswertung[[#This Row],[Autor(in)]]),\"\")","v":""},{"$f":"IF(Tabelle_Auswertung[[#This Row],[Platz]]=8,CONCATENATE(Tabelle_Auswertung[[#This Row],[Bildname]],\" von \",Tabelle_Auswertung[[#This Row],[Autor(in)]]),\"\")","v":""},{"$f":"IF(Tabelle_Auswertung[[#This Row],[Platz]]=9,CONCATENATE(Tabelle_Auswertung[[#This Row],[Bildname]],\" von \",Tabelle_Auswertung[[#This Row],[Autor(in)]]),\"\")","v":""},{"$f":"IF(Tabelle_Auswertung[[#This Row],[Platz]]=10,CONCATENATE(Tabelle_Auswertung[[#This Row],[Bildname]],\" von \",Tabelle_Auswertung[[#This Row],[Autor(in)]]),\"\")","v":""}]
[164,{"$nulls":21},{"$f":"IF(Tabelle_Auswertung[[#This Row],[Bildname]]<>\"\",\n    IF(Tabelle_Auswertung[[#This Row],[abwesend]]=\"ja\",\n        SUM(Tabelle_Auswertung[[#This Row],[Juror 1]:[Juror 20]])/COUNT(Tabelle_Auswertung[[#This Row],[Juror 1]:[Juror 20]])*(COUNT(Tabelle_Auswertung[[#This Row],[Juror 1]:[Juror 20]])-1),\n        SUM(Tabelle_Auswertung[[#This Row],[Juror 1]:[Juror 20]])\n    ),\n\" - \")","v":" - "},{"$f":"IF(Tabelle_Auswertung[[#This Row],[Bildname]]<>\"\",IF(Tabelle_Auswertung[[#This Row],[Punkte]]>0,AVERAGE(Tabelle_Auswertung[[#This Row],[Juror 1]:[Juror 20]]),\" - \"),\" - \")","v":" - "},{"$f":"IF(Tabelle_Auswertung[[#This Row],[Bildname]]<>\"\",IF(Tabelle_Auswertung[[#This Row],[Punkte]]>0,RANK(Tabelle_Auswertung[[#This Row],[Punkte]],[Punkte],0),\" - \"),\" - \")","v":" - "}," - - -",null,{"$f":"IF(Tabelle_Auswertung[[#This Row],[Platz]]=1,CONCATENATE(Tabelle_Auswertung[[#This Row],[Bildname]],\" von \",Tabelle_Auswertung[[#This Row],[Autor(in)]]),\"\")","v":""},{"$f":"IF(Tabelle_Auswertung[[#This Row],[Platz]]=2,CONCATENATE(Tabelle_Auswertung[[#This Row],[Bildname]],\" von \",Tabelle_Auswertung[[#This Row],[Autor(in)]]),\"\")","v":""},{"$f":"IF(Tabelle_Auswertung[[#This Row],[Platz]]=3,CONCATENATE(Tabelle_Auswertung[[#This Row],[Bildname]],\" von \",Tabelle_Auswertung[[#This Row],[Autor(in)]]),\"\")","v":""},{"$f":"IF(Tabelle_Auswertung[[#This Row],[Platz]]=4,CONCATENATE(Tabelle_Auswertung[[#This Row],[Bildname]],\" von \",Tabelle_Auswertung[[#This Row],[Autor(in)]]),\"\")","v":""},{"$f":"IF(Tabelle_Auswertung[[#This Row],[Platz]]=5,CONCATENATE(Tabelle_Auswertung[[#This Row],[Bildname]],\" von \",Tabelle_Auswertung[[#This Row],[Autor(in)]]),\"\")","v":""},{"$f":"IF(Tabelle_Auswertung[[#This Row],[Platz]]=6,CONCATENATE(Tabelle_Auswertung[[#This Row],[Bildname]],\" von \",Tabelle_Auswertung[[#This Row],[Autor(in)]]),\"\")","v":""},{"$f":"IF(Tabelle_Auswertung[[#This Row],[Platz]]=7,CONCATENATE(Tabelle_Auswertung[[#This Row],[Bildname]],\" von \",Tabelle_Auswertung[[#This Row],[Autor(in)]]),\"\")","v":""},{"$f":"IF(Tabelle_Auswertung[[#This Row],[Platz]]=8,CONCATENATE(Tabelle_Auswertung[[#This Row],[Bildname]],\" von \",Tabelle_Auswertung[[#This Row],[Autor(in)]]),\"\")","v":""},{"$f":"IF(Tabelle_Auswertung[[#This Row],[Platz]]=9,CONCATENATE(Tabelle_Auswertung[[#This Row],[Bildname]],\" von \",Tabelle_Auswertung[[#This Row],[Autor(in)]]),\"\")","v":""},{"$f":"IF(Tabelle_Auswertung[[#This Row],[Platz]]=10,CONCATENATE(Tabelle_Auswertung[[#This Row],[Bildname]],\" von \",Tabelle_Auswertung[[#This Row],[Autor(in)]]),\"\")","v":""}]
[165,{"$nulls":21},{"$f":"IF(Tabelle_Auswertung[[#This Row],[Bildname]]<>\"\",\n    IF(Tabelle_Auswertung[[#This Row],[abwesend]]=\"ja\",\n        SUM(Tabelle_Auswertung[[#This Row],[Juror 1]:[Juror 20]])/COUNT(Tabelle_Auswertung[[#This Row],[Juror 1]:[Juror 20]])*(COUNT(Tabelle_Auswertung[[#This Row],[Juror 1]:[Juror 20]])-1),\n        SUM(Tabelle_Auswertung[[#This Row],[Juror 1]:[Juror 20]])\n    ),\n\" - \")","v":" - "},{"$f":"IF(Tabelle_Auswertung[[#This Row],[Bildname]]<>\"\",IF(Tabelle_Auswertung[[#This Row],[Punkte]]>0,AVERAGE(Tabelle_Auswertung[[#This Row],[Juror 1]:[Juror 20]]),\" - \"),\" - \")","v":" - "},{"$f":"IF(Tabelle_Auswertung[[#This Row],[Bildname]]<>\"\",IF(Tabelle_Auswertung[[#This Row],[Punkte]]>0,RANK(Tabelle_Auswertung[[#This Row],[Punkte]],[Punkte],0),\" - \"),\" - \")","v":" - "}," - - -",null,{"$f":"IF(Tabelle_Auswertung[[#This Row],[Platz]]=1,CONCATENATE(Tabelle_Auswertung[[#This Row],[Bildname]],\" von \",Tabelle_Auswertung[[#This Row],[Autor(in)]]),\"\")","v":""},{"$f":"IF(Tabelle_Auswertung[[#This Row],[Platz]]=2,CONCATENATE(Tabelle_Auswertung[[#This Row],[Bildname]],\" von \",Tabelle_Auswertung[[#This Row],[Autor(in)]]),\"\")","v":""},{"$f":"IF(Tabelle_Auswertung[[#This Row],[Platz]]=3,CONCATENATE(Tabelle_Auswertung[[#This Row],[Bildname]],\" von \",Tabelle_Auswertung[[#This Row],[Autor(in)]]),\"\")","v":""},{"$f":"IF(Tabelle_Auswertung[[#This Row],[Platz]]=4,CONCATENATE(Tabelle_Auswertung[[#This Row],[Bildname]],\" von \",Tabelle_Auswertung[[#This Row],[Autor(in)]]),\"\")","v":""},{"$f":"IF(Tabelle_Auswertung[[#This Row],[Platz]]=5,CONCATENATE(Tabelle_Auswertung[[#This Row],[Bildname]],\" von \",Tabelle_Auswertung[[#This Row],[Autor(in)]]),\"\")","v":""},{"$f":"IF(Tabelle_Auswertung[[#This Row],[Platz]]=6,CONCATENATE(Tabelle_Auswertung[[#This Row],[Bildname]],\" von \",Tabelle_Auswertung[[#This Row],[Autor(in)]]),\"\")","v":""},{"$f":"IF(Tabelle_Auswertung[[#This Row],[Platz]]=7,CONCATENATE(Tabelle_Auswertung[[#This Row],[Bildname]],\" von \",Tabelle_Auswertung[[#This Row],[Autor(in)]]),\"\")","v":""},{"$f":"IF(Tabelle_Auswertung[[#This Row],[Platz]]=8,CONCATENATE(Tabelle_Auswertung[[#This Row],[Bildname]],\" von \",Tabelle_Auswertung[[#This Row],[Autor(in)]]),\"\")","v":""},{"$f":"IF(Tabelle_Auswertung[[#This Row],[Platz]]=9,CONCATENATE(Tabelle_Auswertung[[#This Row],[Bildname]],\" von \",Tabelle_Auswertung[[#This Row],[Autor(in)]]),\"\")","v":""},{"$f":"IF(Tabelle_Auswertung[[#This Row],[Platz]]=10,CONCATENATE(Tabelle_Auswertung[[#This Row],[Bildname]],\" von \",Tabelle_Auswertung[[#This Row],[Autor(in)]]),\"\")","v":""}]
[166,{"$nulls":21},{"$f":"IF(Tabelle_Auswertung[[#This Row],[Bildname]]<>\"\",\n    IF(Tabelle_Auswertung[[#This Row],[abwesend]]=\"ja\",\n        SUM(Tabelle_Auswertung[[#This Row],[Juror 1]:[Juror 20]])/COUNT(Tabelle_Auswertung[[#This Row],[Juror 1]:[Juror 20]])*(COUNT(Tabelle_Auswertung[[#This Row],[Juror 1]:[Juror 20]])-1),\n        SUM(Tabelle_Auswertung[[#This Row],[Juror 1]:[Juror 20]])\n    ),\n\" - \")","v":" - "},{"$f":"IF(Tabelle_Auswertung[[#This Row],[Bildname]]<>\"\",IF(Tabelle_Auswertung[[#This Row],[Punkte]]>0,AVERAGE(Tabelle_Auswertung[[#This Row],[Juror 1]:[Juror 20]]),\" - \"),\" - \")","v":" - "},{"$f":"IF(Tabelle_Auswertung[[#This Row],[Bildname]]<>\"\",IF(Tabelle_Auswertung[[#This Row],[Punkte]]>0,RANK(Tabelle_Auswertung[[#This Row],[Punkte]],[Punkte],0),\" - \"),\" - \")","v":" - "}," - - -",null,{"$f":"IF(Tabelle_Auswertung[[#This Row],[Platz]]=1,CONCATENATE(Tabelle_Auswertung[[#This Row],[Bildname]],\" von \",Tabelle_Auswertung[[#This Row],[Autor(in)]]),\"\")","v":""},{"$f":"IF(Tabelle_Auswertung[[#This Row],[Platz]]=2,CONCATENATE(Tabelle_Auswertung[[#This Row],[Bildname]],\" von \",Tabelle_Auswertung[[#This Row],[Autor(in)]]),\"\")","v":""},{"$f":"IF(Tabelle_Auswertung[[#This Row],[Platz]]=3,CONCATENATE(Tabelle_Auswertung[[#This Row],[Bildname]],\" von \",Tabelle_Auswertung[[#This Row],[Autor(in)]]),\"\")","v":""},{"$f":"IF(Tabelle_Auswertung[[#This Row],[Platz]]=4,CONCATENATE(Tabelle_Auswertung[[#This Row],[Bildname]],\" von \",Tabelle_Auswertung[[#This Row],[Autor(in)]]),\"\")","v":""},{"$f":"IF(Tabelle_Auswertung[[#This Row],[Platz]]=5,CONCATENATE(Tabelle_Auswertung[[#This Row],[Bildname]],\" von \",Tabelle_Auswertung[[#This Row],[Autor(in)]]),\"\")","v":""},{"$f":"IF(Tabelle_Auswertung[[#This Row],[Platz]]=6,CONCATENATE(Tabelle_Auswertung[[#This Row],[Bildname]],\" von \",Tabelle_Auswertung[[#This Row],[Autor(in)]]),\"\")","v":""},{"$f":"IF(Tabelle_Auswertung[[#This Row],[Platz]]=7,CONCATENATE(Tabelle_Auswertung[[#This Row],[Bildname]],\" von \",Tabelle_Auswertung[[#This Row],[Autor(in)]]),\"\")","v":""},{"$f":"IF(Tabelle_Auswertung[[#This Row],[Platz]]=8,CONCATENATE(Tabelle_Auswertung[[#This Row],[Bildname]],\" von \",Tabelle_Auswertung[[#This Row],[Autor(in)]]),\"\")","v":""},{"$f":"IF(Tabelle_Auswertung[[#This Row],[Platz]]=9,CONCATENATE(Tabelle_Auswertung[[#This Row],[Bildname]],\" von \",Tabelle_Auswertung[[#This Row],[Autor(in)]]),\"\")","v":""},{"$f":"IF(Tabelle_Auswertung[[#This Row],[Platz]]=10,CONCATENATE(Tabelle_Auswertung[[#This Row],[Bildname]],\" von \",Tabelle_Auswertung[[#This Row],[Autor(in)]]),\"\")","v":""}]
[167,{"$nulls":21},{"$f":"IF(Tabelle_Auswertung[[#This Row],[Bildname]]<>\"\",\n    IF(Tabelle_Auswertung[[#This Row],[abwesend]]=\"ja\",\n        SUM(Tabelle_Auswertung[[#This Row],[Juror 1]:[Juror 20]])/COUNT(Tabelle_Auswertung[[#This Row],[Juror 1]:[Juror 20]])*(COUNT(Tabelle_Auswertung[[#This Row],[Juror 1]:[Juror 20]])-1),\n        SUM(Tabelle_Auswertung[[#This Row],[Juror 1]:[Juror 20]])\n    ),\n\" - \")","v":" - "},{"$f":"IF(Tabelle_Auswertung[[#This Row],[Bildname]]<>\"\",IF(Tabelle_Auswertung[[#This Row],[Punkte]]>0,AVERAGE(Tabelle_Auswertung[[#This Row],[Juror 1]:[Juror 20]]),\" - \"),\" - \")","v":" - "},{"$f":"IF(Tabelle_Auswertung[[#This Row],[Bildname]]<>\"\",IF(Tabelle_Auswertung[[#This Row],[Punkte]]>0,RANK(Tabelle_Auswertung[[#This Row],[Punkte]],[Punkte],0),\" - \"),\" - \")","v":" - "}," - - -",null,{"$f":"IF(Tabelle_Auswertung[[#This Row],[Platz]]=1,CONCATENATE(Tabelle_Auswertung[[#This Row],[Bildname]],\" von \",Tabelle_Auswertung[[#This Row],[Autor(in)]]),\"\")","v":""},{"$f":"IF(Tabelle_Auswertung[[#This Row],[Platz]]=2,CONCATENATE(Tabelle_Auswertung[[#This Row],[Bildname]],\" von \",Tabelle_Auswertung[[#This Row],[Autor(in)]]),\"\")","v":""},{"$f":"IF(Tabelle_Auswertung[[#This Row],[Platz]]=3,CONCATENATE(Tabelle_Auswertung[[#This Row],[Bildname]],\" von \",Tabelle_Auswertung[[#This Row],[Autor(in)]]),\"\")","v":""},{"$f":"IF(Tabelle_Auswertung[[#This Row],[Platz]]=4,CONCATENATE(Tabelle_Auswertung[[#This Row],[Bildname]],\" von \",Tabelle_Auswertung[[#This Row],[Autor(in)]]),\"\")","v":""},{"$f":"IF(Tabelle_Auswertung[[#This Row],[Platz]]=5,CONCATENATE(Tabelle_Auswertung[[#This Row],[Bildname]],\" von \",Tabelle_Auswertung[[#This Row],[Autor(in)]]),\"\")","v":""},{"$f":"IF(Tabelle_Auswertung[[#This Row],[Platz]]=6,CONCATENATE(Tabelle_Auswertung[[#This Row],[Bildname]],\" von \",Tabelle_Auswertung[[#This Row],[Autor(in)]]),\"\")","v":""},{"$f":"IF(Tabelle_Auswertung[[#This Row],[Platz]]=7,CONCATENATE(Tabelle_Auswertung[[#This Row],[Bildname]],\" von \",Tabelle_Auswertung[[#This Row],[Autor(in)]]),\"\")","v":""},{"$f":"IF(Tabelle_Auswertung[[#This Row],[Platz]]=8,CONCATENATE(Tabelle_Auswertung[[#This Row],[Bildname]],\" von \",Tabelle_Auswertung[[#This Row],[Autor(in)]]),\"\")","v":""},{"$f":"IF(Tabelle_Auswertung[[#This Row],[Platz]]=9,CONCATENATE(Tabelle_Auswertung[[#This Row],[Bildname]],\" von \",Tabelle_Auswertung[[#This Row],[Autor(in)]]),\"\")","v":""},{"$f":"IF(Tabelle_Auswertung[[#This Row],[Platz]]=10,CONCATENATE(Tabelle_Auswertung[[#This Row],[Bildname]],\" von \",Tabelle_Auswertung[[#This Row],[Autor(in)]]),\"\")","v":""}]
[168,{"$nulls":21},{"$f":"IF(Tabelle_Auswertung[[#This Row],[Bildname]]<>\"\",\n    IF(Tabelle_Auswertung[[#This Row],[abwesend]]=\"ja\",\n        SUM(Tabelle_Auswertung[[#This Row],[Juror 1]:[Juror 20]])/COUNT(Tabelle_Auswertung[[#This Row],[Juror 1]:[Juror 20]])*(COUNT(Tabelle_Auswertung[[#This Row],[Juror 1]:[Juror 20]])-1),\n        SUM(Tabelle_Auswertung[[#This Row],[Juror 1]:[Juror 20]])\n    ),\n\" - \")","v":" - "},{"$f":"IF(Tabelle_Auswertung[[#This Row],[Bildname]]<>\"\",IF(Tabelle_Auswertung[[#This Row],[Punkte]]>0,AVERAGE(Tabelle_Auswertung[[#This Row],[Juror 1]:[Juror 20]]),\" - \"),\" - \")","v":" - "},{"$f":"IF(Tabelle_Auswertung[[#This Row],[Bildname]]<>\"\",IF(Tabelle_Auswertung[[#This Row],[Punkte]]>0,RANK(Tabelle_Auswertung[[#This Row],[Punkte]],[Punkte],0),\" - \"),\" - \")","v":" - "}," - - -",null,{"$f":"IF(Tabelle_Auswertung[[#This Row],[Platz]]=1,CONCATENATE(Tabelle_Auswertung[[#This Row],[Bildname]],\" von \",Tabelle_Auswertung[[#This Row],[Autor(in)]]),\"\")","v":""},{"$f":"IF(Tabelle_Auswertung[[#This Row],[Platz]]=2,CONCATENATE(Tabelle_Auswertung[[#This Row],[Bildname]],\" von \",Tabelle_Auswertung[[#This Row],[Autor(in)]]),\"\")","v":""},{"$f":"IF(Tabelle_Auswertung[[#This Row],[Platz]]=3,CONCATENATE(Tabelle_Auswertung[[#This Row],[Bildname]],\" von \",Tabelle_Auswertung[[#This Row],[Autor(in)]]),\"\")","v":""},{"$f":"IF(Tabelle_Auswertung[[#This Row],[Platz]]=4,CONCATENATE(Tabelle_Auswertung[[#This Row],[Bildname]],\" von \",Tabelle_Auswertung[[#This Row],[Autor(in)]]),\"\")","v":""},{"$f":"IF(Tabelle_Auswertung[[#This Row],[Platz]]=5,CONCATENATE(Tabelle_Auswertung[[#This Row],[Bildname]],\" von \",Tabelle_Auswertung[[#This Row],[Autor(in)]]),\"\")","v":""},{"$f":"IF(Tabelle_Auswertung[[#This Row],[Platz]]=6,CONCATENATE(Tabelle_Auswertung[[#This Row],[Bildname]],\" von \",Tabelle_Auswertung[[#This Row],[Autor(in)]]),\"\")","v":""},{"$f":"IF(Tabelle_Auswertung[[#This Row],[Platz]]=7,CONCATENATE(Tabelle_Auswertung[[#This Row],[Bildname]],\" von \",Tabelle_Auswertung[[#This Row],[Autor(in)]]),\"\")","v":""},{"$f":"IF(Tabelle_Auswertung[[#This Row],[Platz]]=8,CONCATENATE(Tabelle_Auswertung[[#This Row],[Bildname]],\" von \",Tabelle_Auswertung[[#This Row],[Autor(in)]]),\"\")","v":""},{"$f":"IF(Tabelle_Auswertung[[#This Row],[Platz]]=9,CONCATENATE(Tabelle_Auswertung[[#This Row],[Bildname]],\" von \",Tabelle_Auswertung[[#This Row],[Autor(in)]]),\"\")","v":""},{"$f":"IF(Tabelle_Auswertung[[#This Row],[Platz]]=10,CONCATENATE(Tabelle_Auswertung[[#This Row],[Bildname]],\" von \",Tabelle_Auswertung[[#This Row],[Autor(in)]]),\"\")","v":""}]
[169,{"$nulls":21},{"$f":"IF(Tabelle_Auswertung[[#This Row],[Bildname]]<>\"\",\n    IF(Tabelle_Auswertung[[#This Row],[abwesend]]=\"ja\",\n        SUM(Tabelle_Auswertung[[#This Row],[Juror 1]:[Juror 20]])/COUNT(Tabelle_Auswertung[[#This Row],[Juror 1]:[Juror 20]])*(COUNT(Tabelle_Auswertung[[#This Row],[Juror 1]:[Juror 20]])-1),\n        SUM(Tabelle_Auswertung[[#This Row],[Juror 1]:[Juror 20]])\n    ),\n\" - \")","v":" - "},{"$f":"IF(Tabelle_Auswertung[[#This Row],[Bildname]]<>\"\",IF(Tabelle_Auswertung[[#This Row],[Punkte]]>0,AVERAGE(Tabelle_Auswertung[[#This Row],[Juror 1]:[Juror 20]]),\" - \"),\" - \")","v":" - "},{"$f":"IF(Tabelle_Auswertung[[#This Row],[Bildname]]<>\"\",IF(Tabelle_Auswertung[[#This Row],[Punkte]]>0,RANK(Tabelle_Auswertung[[#This Row],[Punkte]],[Punkte],0),\" - \"),\" - \")","v":" - "}," - - -",null,{"$f":"IF(Tabelle_Auswertung[[#This Row],[Platz]]=1,CONCATENATE(Tabelle_Auswertung[[#This Row],[Bildname]],\" von \",Tabelle_Auswertung[[#This Row],[Autor(in)]]),\"\")","v":""},{"$f":"IF(Tabelle_Auswertung[[#This Row],[Platz]]=2,CONCATENATE(Tabelle_Auswertung[[#This Row],[Bildname]],\" von \",Tabelle_Auswertung[[#This Row],[Autor(in)]]),\"\")","v":""},{"$f":"IF(Tabelle_Auswertung[[#This Row],[Platz]]=3,CONCATENATE(Tabelle_Auswertung[[#This Row],[Bildname]],\" von \",Tabelle_Auswertung[[#This Row],[Autor(in)]]),\"\")","v":""},{"$f":"IF(Tabelle_Auswertung[[#This Row],[Platz]]=4,CONCATENATE(Tabelle_Auswertung[[#This Row],[Bildname]],\" von \",Tabelle_Auswertung[[#This Row],[Autor(in)]]),\"\")","v":""},{"$f":"IF(Tabelle_Auswertung[[#This Row],[Platz]]=5,CONCATENATE(Tabelle_Auswertung[[#This Row],[Bildname]],\" von \",Tabelle_Auswertung[[#This Row],[Autor(in)]]),\"\")","v":""},{"$f":"IF(Tabelle_Auswertung[[#This Row],[Platz]]=6,CONCATENATE(Tabelle_Auswertung[[#This Row],[Bildname]],\" von \",Tabelle_Auswertung[[#This Row],[Autor(in)]]),\"\")","v":""},{"$f":"IF(Tabelle_Auswertung[[#This Row],[Platz]]=7,CONCATENATE(Tabelle_Auswertung[[#This Row],[Bildname]],\" von \",Tabelle_Auswertung[[#This Row],[Autor(in)]]),\"\")","v":""},{"$f":"IF(Tabelle_Auswertung[[#This Row],[Platz]]=8,CONCATENATE(Tabelle_Auswertung[[#This Row],[Bildname]],\" von \",Tabelle_Auswertung[[#This Row],[Autor(in)]]),\"\")","v":""},{"$f":"IF(Tabelle_Auswertung[[#This Row],[Platz]]=9,CONCATENATE(Tabelle_Auswertung[[#This Row],[Bildname]],\" von \",Tabelle_Auswertung[[#This Row],[Autor(in)]]),\"\")","v":""},{"$f":"IF(Tabelle_Auswertung[[#This Row],[Platz]]=10,CONCATENATE(Tabelle_Auswertung[[#This Row],[Bildname]],\" von \",Tabelle_Auswertung[[#This Row],[Autor(in)]]),\"\")","v":""}]
[170,{"$nulls":21},{"$f":"IF(Tabelle_Auswertung[[#This Row],[Bildname]]<>\"\",\n    IF(Tabelle_Auswertung[[#This Row],[abwesend]]=\"ja\",\n        SUM(Tabelle_Auswertung[[#This Row],[Juror 1]:[Juror 20]])/COUNT(Tabelle_Auswertung[[#This Row],[Juror 1]:[Juror 20]])*(COUNT(Tabelle_Auswertung[[#This Row],[Juror 1]:[Juror 20]])-1),\n        SUM(Tabelle_Auswertung[[#This Row],[Juror 1]:[Juror 20]])\n    ),\n\" - \")","v":" - "},{"$f":"IF(Tabelle_Auswertung[[#This Row],[Bildname]]<>\"\",IF(Tabelle_Auswertung[[#This Row],[Punkte]]>0,AVERAGE(Tabelle_Auswertung[[#This Row],[Juror 1]:[Juror 20]]),\" - \"),\" - \")","v":" - "},{"$f":"IF(Tabelle_Auswertung[[#This Row],[Bildname]]<>\"\",IF(Tabelle_Auswertung[[#This Row],[Punkte]]>0,RANK(Tabelle_Auswertung[[#This Row],[Punkte]],[Punkte],0),\" - \"),\" - \")","v":" - "}," - - -",null,{"$f":"IF(Tabelle_Auswertung[[#This Row],[Platz]]=1,CONCATENATE(Tabelle_Auswertung[[#This Row],[Bildname]],\" von \",Tabelle_Auswertung[[#This Row],[Autor(in)]]),\"\")","v":""},{"$f":"IF(Tabelle_Auswertung[[#This Row],[Platz]]=2,CONCATENATE(Tabelle_Auswertung[[#This Row],[Bildname]],\" von \",Tabelle_Auswertung[[#This Row],[Autor(in)]]),\"\")","v":""},{"$f":"IF(Tabelle_Auswertung[[#This Row],[Platz]]=3,CONCATENATE(Tabelle_Auswertung[[#This Row],[Bildname]],\" von \",Tabelle_Auswertung[[#This Row],[Autor(in)]]),\"\")","v":""},{"$f":"IF(Tabelle_Auswertung[[#This Row],[Platz]]=4,CONCATENATE(Tabelle_Auswertung[[#This Row],[Bildname]],\" von \",Tabelle_Auswertung[[#This Row],[Autor(in)]]),\"\")","v":""},{"$f":"IF(Tabelle_Auswertung[[#This Row],[Platz]]=5,CONCATENATE(Tabelle_Auswertung[[#This Row],[Bildname]],\" von \",Tabelle_Auswertung[[#This Row],[Autor(in)]]),\"\")","v":""},{"$f":"IF(Tabelle_Auswertung[[#This Row],[Platz]]=6,CONCATENATE(Tabelle_Auswertung[[#This Row],[Bildname]],\" von \",Tabelle_Auswertung[[#This Row],[Autor(in)]]),\"\")","v":""},{"$f":"IF(Tabelle_Auswertung[[#This Row],[Platz]]=7,CONCATENATE(Tabelle_Auswertung[[#This Row],[Bildname]],\" von \",Tabelle_Auswertung[[#This Row],[Autor(in)]]),\"\")","v":""},{"$f":"IF(Tabelle_Auswertung[[#This Row],[Platz]]=8,CONCATENATE(Tabelle_Auswertung[[#This Row],[Bildname]],\" von \",Tabelle_Auswertung[[#This Row],[Autor(in)]]),\"\")","v":""},{"$f":"IF(Tabelle_Auswertung[[#This Row],[Platz]]=9,CONCATENATE(Tabelle_Auswertung[[#This Row],[Bildname]],\" von \",Tabelle_Auswertung[[#This Row],[Autor(in)]]),\"\")","v":""},{"$f":"IF(Tabelle_Auswertung[[#This Row],[Platz]]=10,CONCATENATE(Tabelle_Auswertung[[#This Row],[Bildname]],\" von \",Tabelle_Auswertung[[#This Row],[Autor(in)]]),\"\")","v":""}]
[171,{"$nulls":21},{"$f":"IF(Tabelle_Auswertung[[#This Row],[Bildname]]<>\"\",\n    IF(Tabelle_Auswertung[[#This Row],[abwesend]]=\"ja\",\n        SUM(Tabelle_Auswertung[[#This Row],[Juror 1]:[Juror 20]])/COUNT(Tabelle_Auswertung[[#This Row],[Juror 1]:[Juror 20]])*(COUNT(Tabelle_Auswertung[[#This Row],[Juror 1]:[Juror 20]])-1),\n        SUM(Tabelle_Auswertung[[#This Row],[Juror 1]:[Juror 20]])\n    ),\n\" - \")","v":" - "},{"$f":"IF(Tabelle_Auswertung[[#This Row],[Bildname]]<>\"\",IF(Tabelle_Auswertung[[#This Row],[Punkte]]>0,AVERAGE(Tabelle_Auswertung[[#This Row],[Juror 1]:[Juror 20]]),\" - \"),\" - \")","v":" - "},{"$f":"IF(Tabelle_Auswertung[[#This Row],[Bildname]]<>\"\",IF(Tabelle_Auswertung[[#This Row],[Punkte]]>0,RANK(Tabelle_Auswertung[[#This Row],[Punkte]],[Punkte],0),\" - \"),\" - \")","v":" - "}," - - -",null,{"$f":"IF(Tabelle_Auswertung[[#This Row],[Platz]]=1,CONCATENATE(Tabelle_Auswertung[[#This Row],[Bildname]],\" von \",Tabelle_Auswertung[[#This Row],[Autor(in)]]),\"\")","v":""},{"$f":"IF(Tabelle_Auswertung[[#This Row],[Platz]]=2,CONCATENATE(Tabelle_Auswertung[[#This Row],[Bildname]],\" von \",Tabelle_Auswertung[[#This Row],[Autor(in)]]),\"\")","v":""},{"$f":"IF(Tabelle_Auswertung[[#This Row],[Platz]]=3,CONCATENATE(Tabelle_Auswertung[[#This Row],[Bildname]],\" von \",Tabelle_Auswertung[[#This Row],[Autor(in)]]),\"\")","v":""},{"$f":"IF(Tabelle_Auswertung[[#This Row],[Platz]]=4,CONCATENATE(Tabelle_Auswertung[[#This Row],[Bildname]],\" von \",Tabelle_Auswertung[[#This Row],[Autor(in)]]),\"\")","v":""},{"$f":"IF(Tabelle_Auswertung[[#This Row],[Platz]]=5,CONCATENATE(Tabelle_Auswertung[[#This Row],[Bildname]],\" von \",Tabelle_Auswertung[[#This Row],[Autor(in)]]),\"\")","v":""},{"$f":"IF(Tabelle_Auswertung[[#This Row],[Platz]]=6,CONCATENATE(Tabelle_Auswertung[[#This Row],[Bildname]],\" von \",Tabelle_Auswertung[[#This Row],[Autor(in)]]),\"\")","v":""},{"$f":"IF(Tabelle_Auswertung[[#This Row],[Platz]]=7,CONCATENATE(Tabelle_Auswertung[[#This Row],[Bildname]],\" von \",Tabelle_Auswertung[[#This Row],[Autor(in)]]),\"\")","v":""},{"$f":"IF(Tabelle_Auswertung[[#This Row],[Platz]]=8,CONCATENATE(Tabelle_Auswertung[[#This Row],[Bildname]],\" von \",Tabelle_Auswertung[[#This Row],[Autor(in)]]),\"\")","v":""},{"$f":"IF(Tabelle_Auswertung[[#This Row],[Platz]]=9,CONCATENATE(Tabelle_Auswertung[[#This Row],[Bildname]],\" von \",Tabelle_Auswertung[[#This Row],[Autor(in)]]),\"\")","v":""},{"$f":"IF(Tabelle_Auswertung[[#This Row],[Platz]]=10,CONCATENATE(Tabelle_Auswertung[[#This Row],[Bildname]],\" von \",Tabelle_Auswertung[[#This Row],[Autor(in)]]),\"\")","v":""}]
[172,{"$nulls":21},{"$f":"IF(Tabelle_Auswertung[[#This Row],[Bildname]]<>\"\",\n    IF(Tabelle_Auswertung[[#This Row],[abwesend]]=\"ja\",\n        SUM(Tabelle_Auswertung[[#This Row],[Juror 1]:[Juror 20]])/COUNT(Tabelle_Auswertung[[#This Row],[Juror 1]:[Juror 20]])*(COUNT(Tabelle_Auswertung[[#This Row],[Juror 1]:[Juror 20]])-1),\n        SUM(Tabelle_Auswertung[[#This Row],[Juror 1]:[Juror 20]])\n    ),\n\" - \")","v":" - "},{"$f":"IF(Tabelle_Auswertung[[#This Row],[Bildname]]<>\"\",IF(Tabelle_Auswertung[[#This Row],[Punkte]]>0,AVERAGE(Tabelle_Auswertung[[#This Row],[Juror 1]:[Juror 20]]),\" - \"),\" - \")","v":" - "},{"$f":"IF(Tabelle_Auswertung[[#This Row],[Bildname]]<>\"\",IF(Tabelle_Auswertung[[#This Row],[Punkte]]>0,RANK(Tabelle_Auswertung[[#This Row],[Punkte]],[Punkte],0),\" - \"),\" - \")","v":" - "}," - - -",null,{"$f":"IF(Tabelle_Auswertung[[#This Row],[Platz]]=1,CONCATENATE(Tabelle_Auswertung[[#This Row],[Bildname]],\" von \",Tabelle_Auswertung[[#This Row],[Autor(in)]]),\"\")","v":""},{"$f":"IF(Tabelle_Auswertung[[#This Row],[Platz]]=2,CONCATENATE(Tabelle_Auswertung[[#This Row],[Bildname]],\" von \",Tabelle_Auswertung[[#This Row],[Autor(in)]]),\"\")","v":""},{"$f":"IF(Tabelle_Auswertung[[#This Row],[Platz]]=3,CONCATENATE(Tabelle_Auswertung[[#This Row],[Bildname]],\" von \",Tabelle_Auswertung[[#This Row],[Autor(in)]]),\"\")","v":""},{"$f":"IF(Tabelle_Auswertung[[#This Row],[Platz]]=4,CONCATENATE(Tabelle_Auswertung[[#This Row],[Bildname]],\" von \",Tabelle_Auswertung[[#This Row],[Autor(in)]]),\"\")","v":""},{"$f":"IF(Tabelle_Auswertung[[#This Row],[Platz]]=5,CONCATENATE(Tabelle_Auswertung[[#This Row],[Bildname]],\" von \",Tabelle_Auswertung[[#This Row],[Autor(in)]]),\"\")","v":""},{"$f":"IF(Tabelle_Auswertung[[#This Row],[Platz]]=6,CONCATENATE(Tabelle_Auswertung[[#This Row],[Bildname]],\" von \",Tabelle_Auswertung[[#This Row],[Autor(in)]]),\"\")","v":""},{"$f":"IF(Tabelle_Auswertung[[#This Row],[Platz]]=7,CONCATENATE(Tabelle_Auswertung[[#This Row],[Bildname]],\" von \",Tabelle_Auswertung[[#This Row],[Autor(in)]]),\"\")","v":""},{"$f":"IF(Tabelle_Auswertung[[#This Row],[Platz]]=8,CONCATENATE(Tabelle_Auswertung[[#This Row],[Bildname]],\" von \",Tabelle_Auswertung[[#This Row],[Autor(in)]]),\"\")","v":""},{"$f":"IF(Tabelle_Auswertung[[#This Row],[Platz]]=9,CONCATENATE(Tabelle_Auswertung[[#This Row],[Bildname]],\" von \",Tabelle_Auswertung[[#This Row],[Autor(in)]]),\"\")","v":""},{"$f":"IF(Tabelle_Auswertung[[#This Row],[Platz]]=10,CONCATENATE(Tabelle_Auswertung[[#This Row],[Bildname]],\" von \",Tabelle_Auswertung[[#This Row],[Autor(in)]]),\"\")","v":""}]
[173,{"$nulls":21},{"$f":"IF(Tabelle_Auswertung[[#This Row],[Bildname]]<>\"\",\n    IF(Tabelle_Auswertung[[#This Row],[abwesend]]=\"ja\",\n        SUM(Tabelle_Auswertung[[#This Row],[Juror 1]:[Juror 20]])/COUNT(Tabelle_Auswertung[[#This Row],[Juror 1]:[Juror 20]])*(COUNT(Tabelle_Auswertung[[#This Row],[Juror 1]:[Juror 20]])-1),\n        SUM(Tabelle_Auswertung[[#This Row],[Juror 1]:[Juror 20]])\n    ),\n\" - \")","v":" - "},{"$f":"IF(Tabelle_Auswertung[[#This Row],[Bildname]]<>\"\",IF(Tabelle_Auswertung[[#This Row],[Punkte]]>0,AVERAGE(Tabelle_Auswertung[[#This Row],[Juror 1]:[Juror 20]]),\" - \"),\" - \")","v":" - "},{"$f":"IF(Tabelle_Auswertung[[#This Row],[Bildname]]<>\"\",IF(Tabelle_Auswertung[[#This Row],[Punkte]]>0,RANK(Tabelle_Auswertung[[#This Row],[Punkte]],[Punkte],0),\" - \"),\" - \")","v":" - "}," - - -",null,{"$f":"IF(Tabelle_Auswertung[[#This Row],[Platz]]=1,CONCATENATE(Tabelle_Auswertung[[#This Row],[Bildname]],\" von \",Tabelle_Auswertung[[#This Row],[Autor(in)]]),\"\")","v":""},{"$f":"IF(Tabelle_Auswertung[[#This Row],[Platz]]=2,CONCATENATE(Tabelle_Auswertung[[#This Row],[Bildname]],\" von \",Tabelle_Auswertung[[#This Row],[Autor(in)]]),\"\")","v":""},{"$f":"IF(Tabelle_Auswertung[[#This Row],[Platz]]=3,CONCATENATE(Tabelle_Auswertung[[#This Row],[Bildname]],\" von \",Tabelle_Auswertung[[#This Row],[Autor(in)]]),\"\")","v":""},{"$f":"IF(Tabelle_Auswertung[[#This Row],[Platz]]=4,CONCATENATE(Tabelle_Auswertung[[#This Row],[Bildname]],\" von \",Tabelle_Auswertung[[#This Row],[Autor(in)]]),\"\")","v":""},{"$f":"IF(Tabelle_Auswertung[[#This Row],[Platz]]=5,CONCATENATE(Tabelle_Auswertung[[#This Row],[Bildname]],\" von \",Tabelle_Auswertung[[#This Row],[Autor(in)]]),\"\")","v":""},{"$f":"IF(Tabelle_Auswertung[[#This Row],[Platz]]=6,CONCATENATE(Tabelle_Auswertung[[#This Row],[Bildname]],\" von \",Tabelle_Auswertung[[#This Row],[Autor(in)]]),\"\")","v":""},{"$f":"IF(Tabelle_Auswertung[[#This Row],[Platz]]=7,CONCATENATE(Tabelle_Auswertung[[#This Row],[Bildname]],\" von \",Tabelle_Auswertung[[#This Row],[Autor(in)]]),\"\")","v":""},{"$f":"IF(Tabelle_Auswertung[[#This Row],[Platz]]=8,CONCATENATE(Tabelle_Auswertung[[#This Row],[Bildname]],\" von \",Tabelle_Auswertung[[#This Row],[Autor(in)]]),\"\")","v":""},{"$f":"IF(Tabelle_Auswertung[[#This Row],[Platz]]=9,CONCATENATE(Tabelle_Auswertung[[#This Row],[Bildname]],\" von \",Tabelle_Auswertung[[#This Row],[Autor(in)]]),\"\")","v":""},{"$f":"IF(Tabelle_Auswertung[[#This Row],[Platz]]=10,CONCATENATE(Tabelle_Auswertung[[#This Row],[Bildname]],\" von \",Tabelle_Auswertung[[#This Row],[Autor(in)]]),\"\")","v":""}]
[174,{"$nulls":21},{"$f":"IF(Tabelle_Auswertung[[#This Row],[Bildname]]<>\"\",\n    IF(Tabelle_Auswertung[[#This Row],[abwesend]]=\"ja\",\n        SUM(Tabelle_Auswertung[[#This Row],[Juror 1]:[Juror 20]])/COUNT(Tabelle_Auswertung[[#This Row],[Juror 1]:[Juror 20]])*(COUNT(Tabelle_Auswertung[[#This Row],[Juror 1]:[Juror 20]])-1),\n        SUM(Tabelle_Auswertung[[#This Row],[Juror 1]:[Juror 20]])\n    ),\n\" - \")","v":" - "},{"$f":"IF(Tabelle_Auswertung[[#This Row],[Bildname]]<>\"\",IF(Tabelle_Auswertung[[#This Row],[Punkte]]>0,AVERAGE(Tabelle_Auswertung[[#This Row],[Juror 1]:[Juror 20]]),\" - \"),\" - \")","v":" - "},{"$f":"IF(Tabelle_Auswertung[[#This Row],[Bildname]]<>\"\",IF(Tabelle_Auswertung[[#This Row],[Punkte]]>0,RANK(Tabelle_Auswertung[[#This Row],[Punkte]],[Punkte],0),\" - \"),\" - \")","v":" - "}," - - -",null,{"$f":"IF(Tabelle_Auswertung[[#This Row],[Platz]]=1,CONCATENATE(Tabelle_Auswertung[[#This Row],[Bildname]],\" von \",Tabelle_Auswertung[[#This Row],[Autor(in)]]),\"\")","v":""},{"$f":"IF(Tabelle_Auswertung[[#This Row],[Platz]]=2,CONCATENATE(Tabelle_Auswertung[[#This Row],[Bildname]],\" von \",Tabelle_Auswertung[[#This Row],[Autor(in)]]),\"\")","v":""},{"$f":"IF(Tabelle_Auswertung[[#This Row],[Platz]]=3,CONCATENATE(Tabelle_Auswertung[[#This Row],[Bildname]],\" von \",Tabelle_Auswertung[[#This Row],[Autor(in)]]),\"\")","v":""},{"$f":"IF(Tabelle_Auswertung[[#This Row],[Platz]]=4,CONCATENATE(Tabelle_Auswertung[[#This Row],[Bildname]],\" von \",Tabelle_Auswertung[[#This Row],[Autor(in)]]),\"\")","v":""},{"$f":"IF(Tabelle_Auswertung[[#This Row],[Platz]]=5,CONCATENATE(Tabelle_Auswertung[[#This Row],[Bildname]],\" von \",Tabelle_Auswertung[[#This Row],[Autor(in)]]),\"\")","v":""},{"$f":"IF(Tabelle_Auswertung[[#This Row],[Platz]]=6,CONCATENATE(Tabelle_Auswertung[[#This Row],[Bildname]],\" von \",Tabelle_Auswertung[[#This Row],[Autor(in)]]),\"\")","v":""},{"$f":"IF(Tabelle_Auswertung[[#This Row],[Platz]]=7,CONCATENATE(Tabelle_Auswertung[[#This Row],[Bildname]],\" von \",Tabelle_Auswertung[[#This Row],[Autor(in)]]),\"\")","v":""},{"$f":"IF(Tabelle_Auswertung[[#This Row],[Platz]]=8,CONCATENATE(Tabelle_Auswertung[[#This Row],[Bildname]],\" von \",Tabelle_Auswertung[[#This Row],[Autor(in)]]),\"\")","v":""},{"$f":"IF(Tabelle_Auswertung[[#This Row],[Platz]]=9,CONCATENATE(Tabelle_Auswertung[[#This Row],[Bildname]],\" von \",Tabelle_Auswertung[[#This Row],[Autor(in)]]),\"\")","v":""},{"$f":"IF(Tabelle_Auswertung[[#This Row],[Platz]]=10,CONCATENATE(Tabelle_Auswertung[[#This Row],[Bildname]],\" von \",Tabelle_Auswertung[[#This Row],[Autor(in)]]),\"\")","v":""}]
[175,{"$nulls":21},{"$f":"IF(Tabelle_Auswertung[[#This Row],[Bildname]]<>\"\",\n    IF(Tabelle_Auswertung[[#This Row],[abwesend]]=\"ja\",\n        SUM(Tabelle_Auswertung[[#This Row],[Juror 1]:[Juror 20]])/COUNT(Tabelle_Auswertung[[#This Row],[Juror 1]:[Juror 20]])*(COUNT(Tabelle_Auswertung[[#This Row],[Juror 1]:[Juror 20]])-1),\n        SUM(Tabelle_Auswertung[[#This Row],[Juror 1]:[Juror 20]])\n    ),\n\" - \")","v":" - "},{"$f":"IF(Tabelle_Auswertung[[#This Row],[Bildname]]<>\"\",IF(Tabelle_Auswertung[[#This Row],[Punkte]]>0,AVERAGE(Tabelle_Auswertung[[#This Row],[Juror 1]:[Juror 20]]),\" - \"),\" - \")","v":" - "},{"$f":"IF(Tabelle_Auswertung[[#This Row],[Bildname]]<>\"\",IF(Tabelle_Auswertung[[#This Row],[Punkte]]>0,RANK(Tabelle_Auswertung[[#This Row],[Punkte]],[Punkte],0),\" - \"),\" - \")","v":" - "}," - - -",null,{"$f":"IF(Tabelle_Auswertung[[#This Row],[Platz]]=1,CONCATENATE(Tabelle_Auswertung[[#This Row],[Bildname]],\" von \",Tabelle_Auswertung[[#This Row],[Autor(in)]]),\"\")","v":""},{"$f":"IF(Tabelle_Auswertung[[#This Row],[Platz]]=2,CONCATENATE(Tabelle_Auswertung[[#This Row],[Bildname]],\" von \",Tabelle_Auswertung[[#This Row],[Autor(in)]]),\"\")","v":""},{"$f":"IF(Tabelle_Auswertung[[#This Row],[Platz]]=3,CONCATENATE(Tabelle_Auswertung[[#This Row],[Bildname]],\" von \",Tabelle_Auswertung[[#This Row],[Autor(in)]]),\"\")","v":""},{"$f":"IF(Tabelle_Auswertung[[#This Row],[Platz]]=4,CONCATENATE(Tabelle_Auswertung[[#This Row],[Bildname]],\" von \",Tabelle_Auswertung[[#This Row],[Autor(in)]]),\"\")","v":""},{"$f":"IF(Tabelle_Auswertung[[#This Row],[Platz]]=5,CONCATENATE(Tabelle_Auswertung[[#This Row],[Bildname]],\" von \",Tabelle_Auswertung[[#This Row],[Autor(in)]]),\"\")","v":""},{"$f":"IF(Tabelle_Auswertung[[#This Row],[Platz]]=6,CONCATENATE(Tabelle_Auswertung[[#This Row],[Bildname]],\" von \",Tabelle_Auswertung[[#This Row],[Autor(in)]]),\"\")","v":""},{"$f":"IF(Tabelle_Auswertung[[#This Row],[Platz]]=7,CONCATENATE(Tabelle_Auswertung[[#This Row],[Bildname]],\" von \",Tabelle_Auswertung[[#This Row],[Autor(in)]]),\"\")","v":""},{"$f":"IF(Tabelle_Auswertung[[#This Row],[Platz]]=8,CONCATENATE(Tabelle_Auswertung[[#This Row],[Bildname]],\" von \",Tabelle_Auswertung[[#This Row],[Autor(in)]]),\"\")","v":""},{"$f":"IF(Tabelle_Auswertung[[#This Row],[Platz]]=9,CONCATENATE(Tabelle_Auswertung[[#This Row],[Bildname]],\" von \",Tabelle_Auswertung[[#This Row],[Autor(in)]]),\"\")","v":""},{"$f":"IF(Tabelle_Auswertung[[#This Row],[Platz]]=10,CONCATENATE(Tabelle_Auswertung[[#This Row],[Bildname]],\" von \",Tabelle_Auswertung[[#This Row],[Autor(in)]]),\"\")","v":""}]
[176,{"$nulls":21},{"$f":"IF(Tabelle_Auswertung[[#This Row],[Bildname]]<>\"\",\n    IF(Tabelle_Auswertung[[#This Row],[abwesend]]=\"ja\",\n        SUM(Tabelle_Auswertung[[#This Row],[Juror 1]:[Juror 20]])/COUNT(Tabelle_Auswertung[[#This Row],[Juror 1]:[Juror 20]])*(COUNT(Tabelle_Auswertung[[#This Row],[Juror 1]:[Juror 20]])-1),\n        SUM(Tabelle_Auswertung[[#This Row],[Juror 1]:[Juror 20]])\n    ),\n\" - \")","v":" - "},{"$f":"IF(Tabelle_Auswertung[[#This Row],[Bildname]]<>\"\",IF(Tabelle_Auswertung[[#This Row],[Punkte]]>0,AVERAGE(Tabelle_Auswertung[[#This Row],[Juror 1]:[Juror 20]]),\" - \"),\" - \")","v":" - "},{"$f":"IF(Tabelle_Auswertung[[#This Row],[Bildname]]<>\"\",IF(Tabelle_Auswertung[[#This Row],[Punkte]]>0,RANK(Tabelle_Auswertung[[#This Row],[Punkte]],[Punkte],0),\" - \"),\" - \")","v":" - "}," - - -",null,{"$f":"IF(Tabelle_Auswertung[[#This Row],[Platz]]=1,CONCATENATE(Tabelle_Auswertung[[#This Row],[Bildname]],\" von \",Tabelle_Auswertung[[#This Row],[Autor(in)]]),\"\")","v":""},{"$f":"IF(Tabelle_Auswertung[[#This Row],[Platz]]=2,CONCATENATE(Tabelle_Auswertung[[#This Row],[Bildname]],\" von \",Tabelle_Auswertung[[#This Row],[Autor(in)]]),\"\")","v":""},{"$f":"IF(Tabelle_Auswertung[[#This Row],[Platz]]=3,CONCATENATE(Tabelle_Auswertung[[#This Row],[Bildname]],\" von \",Tabelle_Auswertung[[#This Row],[Autor(in)]]),\"\")","v":""},{"$f":"IF(Tabelle_Auswertung[[#This Row],[Platz]]=4,CONCATENATE(Tabelle_Auswertung[[#This Row],[Bildname]],\" von \",Tabelle_Auswertung[[#This Row],[Autor(in)]]),\"\")","v":""},{"$f":"IF(Tabelle_Auswertung[[#This Row],[Platz]]=5,CONCATENATE(Tabelle_Auswertung[[#This Row],[Bildname]],\" von \",Tabelle_Auswertung[[#This Row],[Autor(in)]]),\"\")","v":""},{"$f":"IF(Tabelle_Auswertung[[#This Row],[Platz]]=6,CONCATENATE(Tabelle_Auswertung[[#This Row],[Bildname]],\" von \",Tabelle_Auswertung[[#This Row],[Autor(in)]]),\"\")","v":""},{"$f":"IF(Tabelle_Auswertung[[#This Row],[Platz]]=7,CONCATENATE(Tabelle_Auswertung[[#This Row],[Bildname]],\" von \",Tabelle_Auswertung[[#This Row],[Autor(in)]]),\"\")","v":""},{"$f":"IF(Tabelle_Auswertung[[#This Row],[Platz]]=8,CONCATENATE(Tabelle_Auswertung[[#This Row],[Bildname]],\" von \",Tabelle_Auswertung[[#This Row],[Autor(in)]]),\"\")","v":""},{"$f":"IF(Tabelle_Auswertung[[#This Row],[Platz]]=9,CONCATENATE(Tabelle_Auswertung[[#This Row],[Bildname]],\" von \",Tabelle_Auswertung[[#This Row],[Autor(in)]]),\"\")","v":""},{"$f":"IF(Tabelle_Auswertung[[#This Row],[Platz]]=10,CONCATENATE(Tabelle_Auswertung[[#This Row],[Bildname]],\" von \",Tabelle_Auswertung[[#This Row],[Autor(in)]]),\"\")","v":""}]
[177,{"$nulls":21},{"$f":"IF(Tabelle_Auswertung[[#This Row],[Bildname]]<>\"\",\n    IF(Tabelle_Auswertung[[#This Row],[abwesend]]=\"ja\",\n        SUM(Tabelle_Auswertung[[#This Row],[Juror 1]:[Juror 20]])/COUNT(Tabelle_Auswertung[[#This Row],[Juror 1]:[Juror 20]])*(COUNT(Tabelle_Auswertung[[#This Row],[Juror 1]:[Juror 20]])-1),\n        SUM(Tabelle_Auswertung[[#This Row],[Juror 1]:[Juror 20]])\n    ),\n\" - \")","v":" - "},{"$f":"IF(Tabelle_Auswertung[[#This Row],[Bildname]]<>\"\",IF(Tabelle_Auswertung[[#This Row],[Punkte]]>0,AVERAGE(Tabelle_Auswertung[[#This Row],[Juror 1]:[Juror 20]]),\" - \"),\" - \")","v":" - "},{"$f":"IF(Tabelle_Auswertung[[#This Row],[Bildname]]<>\"\",IF(Tabelle_Auswertung[[#This Row],[Punkte]]>0,RANK(Tabelle_Auswertung[[#This Row],[Punkte]],[Punkte],0),\" - \"),\" - \")","v":" - "}," - - -",null,{"$f":"IF(Tabelle_Auswertung[[#This Row],[Platz]]=1,CONCATENATE(Tabelle_Auswertung[[#This Row],[Bildname]],\" von \",Tabelle_Auswertung[[#This Row],[Autor(in)]]),\"\")","v":""},{"$f":"IF(Tabelle_Auswertung[[#This Row],[Platz]]=2,CONCATENATE(Tabelle_Auswertung[[#This Row],[Bildname]],\" von \",Tabelle_Auswertung[[#This Row],[Autor(in)]]),\"\")","v":""},{"$f":"IF(Tabelle_Auswertung[[#This Row],[Platz]]=3,CONCATENATE(Tabelle_Auswertung[[#This Row],[Bildname]],\" von \",Tabelle_Auswertung[[#This Row],[Autor(in)]]),\"\")","v":""},{"$f":"IF(Tabelle_Auswertung[[#This Row],[Platz]]=4,CONCATENATE(Tabelle_Auswertung[[#This Row],[Bildname]],\" von \",Tabelle_Auswertung[[#This Row],[Autor(in)]]),\"\")","v":""},{"$f":"IF(Tabelle_Auswertung[[#This Row],[Platz]]=5,CONCATENATE(Tabelle_Auswertung[[#This Row],[Bildname]],\" von \",Tabelle_Auswertung[[#This Row],[Autor(in)]]),\"\")","v":""},{"$f":"IF(Tabelle_Auswertung[[#This Row],[Platz]]=6,CONCATENATE(Tabelle_Auswertung[[#This Row],[Bildname]],\" von \",Tabelle_Auswertung[[#This Row],[Autor(in)]]),\"\")","v":""},{"$f":"IF(Tabelle_Auswertung[[#This Row],[Platz]]=7,CONCATENATE(Tabelle_Auswertung[[#This Row],[Bildname]],\" von \",Tabelle_Auswertung[[#This Row],[Autor(in)]]),\"\")","v":""},{"$f":"IF(Tabelle_Auswertung[[#This Row],[Platz]]=8,CONCATENATE(Tabelle_Auswertung[[#This Row],[Bildname]],\" von \",Tabelle_Auswertung[[#This Row],[Autor(in)]]),\"\")","v":""},{"$f":"IF(Tabelle_Auswertung[[#This Row],[Platz]]=9,CONCATENATE(Tabelle_Auswertung[[#This Row],[Bildname]],\" von \",Tabelle_Auswertung[[#This Row],[Autor(in)]]),\"\")","v":""},{"$f":"IF(Tabelle_Auswertung[[#This Row],[Platz]]=10,CONCATENATE(Tabelle_Auswertung[[#This Row],[Bildname]],\" von \",Tabelle_Auswertung[[#This Row],[Autor(in)]]),\"\")","v":""}]
[178,{"$nulls":21},{"$f":"IF(Tabelle_Auswertung[[#This Row],[Bildname]]<>\"\",\n    IF(Tabelle_Auswertung[[#This Row],[abwesend]]=\"ja\",\n        SUM(Tabelle_Auswertung[[#This Row],[Juror 1]:[Juror 20]])/COUNT(Tabelle_Auswertung[[#This Row],[Juror 1]:[Juror 20]])*(COUNT(Tabelle_Auswertung[[#This Row],[Juror 1]:[Juror 20]])-1),\n        SUM(Tabelle_Auswertung[[#This Row],[Juror 1]:[Juror 20]])\n    ),\n\" - \")","v":" - "},{"$f":"IF(Tabelle_Auswertung[[#This Row],[Bildname]]<>\"\",IF(Tabelle_Auswertung[[#This Row],[Punkte]]>0,AVERAGE(Tabelle_Auswertung[[#This Row],[Juror 1]:[Juror 20]]),\" - \"),\" - \")","v":" - "},{"$f":"IF(Tabelle_Auswertung[[#This Row],[Bildname]]<>\"\",IF(Tabelle_Auswertung[[#This Row],[Punkte]]>0,RANK(Tabelle_Auswertung[[#This Row],[Punkte]],[Punkte],0),\" - \"),\" - \")","v":" - "}," - - -",null,{"$f":"IF(Tabelle_Auswertung[[#This Row],[Platz]]=1,CONCATENATE(Tabelle_Auswertung[[#This Row],[Bildname]],\" von \",Tabelle_Auswertung[[#This Row],[Autor(in)]]),\"\")","v":""},{"$f":"IF(Tabelle_Auswertung[[#This Row],[Platz]]=2,CONCATENATE(Tabelle_Auswertung[[#This Row],[Bildname]],\" von \",Tabelle_Auswertung[[#This Row],[Autor(in)]]),\"\")","v":""},{"$f":"IF(Tabelle_Auswertung[[#This Row],[Platz]]=3,CONCATENATE(Tabelle_Auswertung[[#This Row],[Bildname]],\" von \",Tabelle_Auswertung[[#This Row],[Autor(in)]]),\"\")","v":""},{"$f":"IF(Tabelle_Auswertung[[#This Row],[Platz]]=4,CONCATENATE(Tabelle_Auswertung[[#This Row],[Bildname]],\" von \",Tabelle_Auswertung[[#This Row],[Autor(in)]]),\"\")","v":""},{"$f":"IF(Tabelle_Auswertung[[#This Row],[Platz]]=5,CONCATENATE(Tabelle_Auswertung[[#This Row],[Bildname]],\" von \",Tabelle_Auswertung[[#This Row],[Autor(in)]]),\"\")","v":""},{"$f":"IF(Tabelle_Auswertung[[#This Row],[Platz]]=6,CONCATENATE(Tabelle_Auswertung[[#This Row],[Bildname]],\" von \",Tabelle_Auswertung[[#This Row],[Autor(in)]]),\"\")","v":""},{"$f":"IF(Tabelle_Auswertung[[#This Row],[Platz]]=7,CONCATENATE(Tabelle_Auswertung[[#This Row],[Bildname]],\" von \",Tabelle_Auswertung[[#This Row],[Autor(in)]]),\"\")","v":""},{"$f":"IF(Tabelle_Auswertung[[#This Row],[Platz]]=8,CONCATENATE(Tabelle_Auswertung[[#This Row],[Bildname]],\" von \",Tabelle_Auswertung[[#This Row],[Autor(in)]]),\"\")","v":""},{"$f":"IF(Tabelle_Auswertung[[#This Row],[Platz]]=9,CONCATENATE(Tabelle_Auswertung[[#This Row],[Bildname]],\" von \",Tabelle_Auswertung[[#This Row],[Autor(in)]]),\"\")","v":""},{"$f":"IF(Tabelle_Auswertung[[#This Row],[Platz]]=10,CONCATENATE(Tabelle_Auswertung[[#This Row],[Bildname]],\" von \",Tabelle_Auswertung[[#This Row],[Autor(in)]]),\"\")","v":""}]
[179,{"$nulls":21},{"$f":"IF(Tabelle_Auswertung[[#This Row],[Bildname]]<>\"\",\n    IF(Tabelle_Auswertung[[#This Row],[abwesend]]=\"ja\",\n        SUM(Tabelle_Auswertung[[#This Row],[Juror 1]:[Juror 20]])/COUNT(Tabelle_Auswertung[[#This Row],[Juror 1]:[Juror 20]])*(COUNT(Tabelle_Auswertung[[#This Row],[Juror 1]:[Juror 20]])-1),\n        SUM(Tabelle_Auswertung[[#This Row],[Juror 1]:[Juror 20]])\n    ),\n\" - \")","v":" - "},{"$f":"IF(Tabelle_Auswertung[[#This Row],[Bildname]]<>\"\",IF(Tabelle_Auswertung[[#This Row],[Punkte]]>0,AVERAGE(Tabelle_Auswertung[[#This Row],[Juror 1]:[Juror 20]]),\" - \"),\" - \")","v":" - "},{"$f":"IF(Tabelle_Auswertung[[#This Row],[Bildname]]<>\"\",IF(Tabelle_Auswertung[[#This Row],[Punkte]]>0,RANK(Tabelle_Auswertung[[#This Row],[Punkte]],[Punkte],0),\" - \"),\" - \")","v":" - "}," - - -",null,{"$f":"IF(Tabelle_Auswertung[[#This Row],[Platz]]=1,CONCATENATE(Tabelle_Auswertung[[#This Row],[Bildname]],\" von \",Tabelle_Auswertung[[#This Row],[Autor(in)]]),\"\")","v":""},{"$f":"IF(Tabelle_Auswertung[[#This Row],[Platz]]=2,CONCATENATE(Tabelle_Auswertung[[#This Row],[Bildname]],\" von \",Tabelle_Auswertung[[#This Row],[Autor(in)]]),\"\")","v":""},{"$f":"IF(Tabelle_Auswertung[[#This Row],[Platz]]=3,CONCATENATE(Tabelle_Auswertung[[#This Row],[Bildname]],\" von \",Tabelle_Auswertung[[#This Row],[Autor(in)]]),\"\")","v":""},{"$f":"IF(Tabelle_Auswertung[[#This Row],[Platz]]=4,CONCATENATE(Tabelle_Auswertung[[#This Row],[Bildname]],\" von \",Tabelle_Auswertung[[#This Row],[Autor(in)]]),\"\")","v":""},{"$f":"IF(Tabelle_Auswertung[[#This Row],[Platz]]=5,CONCATENATE(Tabelle_Auswertung[[#This Row],[Bildname]],\" von \",Tabelle_Auswertung[[#This Row],[Autor(in)]]),\"\")","v":""},{"$f":"IF(Tabelle_Auswertung[[#This Row],[Platz]]=6,CONCATENATE(Tabelle_Auswertung[[#This Row],[Bildname]],\" von \",Tabelle_Auswertung[[#This Row],[Autor(in)]]),\"\")","v":""},{"$f":"IF(Tabelle_Auswertung[[#This Row],[Platz]]=7,CONCATENATE(Tabelle_Auswertung[[#This Row],[Bildname]],\" von \",Tabelle_Auswertung[[#This Row],[Autor(in)]]),\"\")","v":""},{"$f":"IF(Tabelle_Auswertung[[#This Row],[Platz]]=8,CONCATENATE(Tabelle_Auswertung[[#This Row],[Bildname]],\" von \",Tabelle_Auswertung[[#This Row],[Autor(in)]]),\"\")","v":""},{"$f":"IF(Tabelle_Auswertung[[#This Row],[Platz]]=9,CONCATENATE(Tabelle_Auswertung[[#This Row],[Bildname]],\" von \",Tabelle_Auswertung[[#This Row],[Autor(in)]]),\"\")","v":""},{"$f":"IF(Tabelle_Auswertung[[#This Row],[Platz]]=10,CONCATENATE(Tabelle_Auswertung[[#This Row],[Bildname]],\" von \",Tabelle_Auswertung[[#This Row],[Autor(in)]]),\"\")","v":""}]
[180,{"$nulls":21},{"$f":"IF(Tabelle_Auswertung[[#This Row],[Bildname]]<>\"\",\n    IF(Tabelle_Auswertung[[#This Row],[abwesend]]=\"ja\",\n        SUM(Tabelle_Auswertung[[#This Row],[Juror 1]:[Juror 20]])/COUNT(Tabelle_Auswertung[[#This Row],[Juror 1]:[Juror 20]])*(COUNT(Tabelle_Auswertung[[#This Row],[Juror 1]:[Juror 20]])-1),\n        SUM(Tabelle_Auswertung[[#This Row],[Juror 1]:[Juror 20]])\n    ),\n\" - \")","v":" - "},{"$f":"IF(Tabelle_Auswertung[[#This Row],[Bildname]]<>\"\",IF(Tabelle_Auswertung[[#This Row],[Punkte]]>0,AVERAGE(Tabelle_Auswertung[[#This Row],[Juror 1]:[Juror 20]]),\" - \"),\" - \")","v":" - "},{"$f":"IF(Tabelle_Auswertung[[#This Row],[Bildname]]<>\"\",IF(Tabelle_Auswertung[[#This Row],[Punkte]]>0,RANK(Tabelle_Auswertung[[#This Row],[Punkte]],[Punkte],0),\" - \"),\" - \")","v":" - "}," - - -",null,{"$f":"IF(Tabelle_Auswertung[[#This Row],[Platz]]=1,CONCATENATE(Tabelle_Auswertung[[#This Row],[Bildname]],\" von \",Tabelle_Auswertung[[#This Row],[Autor(in)]]),\"\")","v":""},{"$f":"IF(Tabelle_Auswertung[[#This Row],[Platz]]=2,CONCATENATE(Tabelle_Auswertung[[#This Row],[Bildname]],\" von \",Tabelle_Auswertung[[#This Row],[Autor(in)]]),\"\")","v":""},{"$f":"IF(Tabelle_Auswertung[[#This Row],[Platz]]=3,CONCATENATE(Tabelle_Auswertung[[#This Row],[Bildname]],\" von \",Tabelle_Auswertung[[#This Row],[Autor(in)]]),\"\")","v":""},{"$f":"IF(Tabelle_Auswertung[[#This Row],[Platz]]=4,CONCATENATE(Tabelle_Auswertung[[#This Row],[Bildname]],\" von \",Tabelle_Auswertung[[#This Row],[Autor(in)]]),\"\")","v":""},{"$f":"IF(Tabelle_Auswertung[[#This Row],[Platz]]=5,CONCATENATE(Tabelle_Auswertung[[#This Row],[Bildname]],\" von \",Tabelle_Auswertung[[#This Row],[Autor(in)]]),\"\")","v":""},{"$f":"IF(Tabelle_Auswertung[[#This Row],[Platz]]=6,CONCATENATE(Tabelle_Auswertung[[#This Row],[Bildname]],\" von \",Tabelle_Auswertung[[#This Row],[Autor(in)]]),\"\")","v":""},{"$f":"IF(Tabelle_Auswertung[[#This Row],[Platz]]=7,CONCATENATE(Tabelle_Auswertung[[#This Row],[Bildname]],\" von \",Tabelle_Auswertung[[#This Row],[Autor(in)]]),\"\")","v":""},{"$f":"IF(Tabelle_Auswertung[[#This Row],[Platz]]=8,CONCATENATE(Tabelle_Auswertung[[#This Row],[Bildname]],\" von \",Tabelle_Auswertung[[#This Row],[Autor(in)]]),\"\")","v":""},{"$f":"IF(Tabelle_Auswertung[[#This Row],[Platz]]=9,CONCATENATE(Tabelle_Auswertung[[#This Row],[Bildname]],\" von \",Tabelle_Auswertung[[#This Row],[Autor(in)]]),\"\")","v":""},{"$f":"IF(Tabelle_Auswertung[[#This Row],[Platz]]=10,CONCATENATE(Tabelle_Auswertung[[#This Row],[Bildname]],\" von \",Tabelle_Auswertung[[#This Row],[Autor(in)]]),\"\")","v":""}]
[181,{"$nulls":21},{"$f":"IF(Tabelle_Auswertung[[#This Row],[Bildname]]<>\"\",\n    IF(Tabelle_Auswertung[[#This Row],[abwesend]]=\"ja\",\n        SUM(Tabelle_Auswertung[[#This Row],[Juror 1]:[Juror 20]])/COUNT(Tabelle_Auswertung[[#This Row],[Juror 1]:[Juror 20]])*(COUNT(Tabelle_Auswertung[[#This Row],[Juror 1]:[Juror 20]])-1),\n        SUM(Tabelle_Auswertung[[#This Row],[Juror 1]:[Juror 20]])\n    ),\n\" - \")","v":" - "},{"$f":"IF(Tabelle_Auswertung[[#This Row],[Bildname]]<>\"\",IF(Tabelle_Auswertung[[#This Row],[Punkte]]>0,AVERAGE(Tabelle_Auswertung[[#This Row],[Juror 1]:[Juror 20]]),\" - \"),\" - \")","v":" - "},{"$f":"IF(Tabelle_Auswertung[[#This Row],[Bildname]]<>\"\",IF(Tabelle_Auswertung[[#This Row],[Punkte]]>0,RANK(Tabelle_Auswertung[[#This Row],[Punkte]],[Punkte],0),\" - \"),\" - \")","v":" - "}," - - -",null,{"$f":"IF(Tabelle_Auswertung[[#This Row],[Platz]]=1,CONCATENATE(Tabelle_Auswertung[[#This Row],[Bildname]],\" von \",Tabelle_Auswertung[[#This Row],[Autor(in)]]),\"\")","v":""},{"$f":"IF(Tabelle_Auswertung[[#This Row],[Platz]]=2,CONCATENATE(Tabelle_Auswertung[[#This Row],[Bildname]],\" von \",Tabelle_Auswertung[[#This Row],[Autor(in)]]),\"\")","v":""},{"$f":"IF(Tabelle_Auswertung[[#This Row],[Platz]]=3,CONCATENATE(Tabelle_Auswertung[[#This Row],[Bildname]],\" von \",Tabelle_Auswertung[[#This Row],[Autor(in)]]),\"\")","v":""},{"$f":"IF(Tabelle_Auswertung[[#This Row],[Platz]]=4,CONCATENATE(Tabelle_Auswertung[[#This Row],[Bildname]],\" von \",Tabelle_Auswertung[[#This Row],[Autor(in)]]),\"\")","v":""},{"$f":"IF(Tabelle_Auswertung[[#This Row],[Platz]]=5,CONCATENATE(Tabelle_Auswertung[[#This Row],[Bildname]],\" von \",Tabelle_Auswertung[[#This Row],[Autor(in)]]),\"\")","v":""},{"$f":"IF(Tabelle_Auswertung[[#This Row],[Platz]]=6,CONCATENATE(Tabelle_Auswertung[[#This Row],[Bildname]],\" von \",Tabelle_Auswertung[[#This Row],[Autor(in)]]),\"\")","v":""},{"$f":"IF(Tabelle_Auswertung[[#This Row],[Platz]]=7,CONCATENATE(Tabelle_Auswertung[[#This Row],[Bildname]],\" von \",Tabelle_Auswertung[[#This Row],[Autor(in)]]),\"\")","v":""},{"$f":"IF(Tabelle_Auswertung[[#This Row],[Platz]]=8,CONCATENATE(Tabelle_Auswertung[[#This Row],[Bildname]],\" von \",Tabelle_Auswertung[[#This Row],[Autor(in)]]),\"\")","v":""},{"$f":"IF(Tabelle_Auswertung[[#This Row],[Platz]]=9,CONCATENATE(Tabelle_Auswertung[[#This Row],[Bildname]],\" von \",Tabelle_Auswertung[[#This Row],[Autor(in)]]),\"\")","v":""},{"$f":"IF(Tabelle_Auswertung[[#This Row],[Platz]]=10,CONCATENATE(Tabelle_Auswertung[[#This Row],[Bildname]],\" von \",Tabelle_Auswertung[[#This Row],[Autor(in)]]),\"\")","v":""}]
[182,{"$nulls":21},{"$f":"IF(Tabelle_Auswertung[[#This Row],[Bildname]]<>\"\",\n    IF(Tabelle_Auswertung[[#This Row],[abwesend]]=\"ja\",\n        SUM(Tabelle_Auswertung[[#This Row],[Juror 1]:[Juror 20]])/COUNT(Tabelle_Auswertung[[#This Row],[Juror 1]:[Juror 20]])*(COUNT(Tabelle_Auswertung[[#This Row],[Juror 1]:[Juror 20]])-1),\n        SUM(Tabelle_Auswertung[[#This Row],[Juror 1]:[Juror 20]])\n    ),\n\" - \")","v":" - "},{"$f":"IF(Tabelle_Auswertung[[#This Row],[Bildname]]<>\"\",IF(Tabelle_Auswertung[[#This Row],[Punkte]]>0,AVERAGE(Tabelle_Auswertung[[#This Row],[Juror 1]:[Juror 20]]),\" - \"),\" - \")","v":" - "},{"$f":"IF(Tabelle_Auswertung[[#This Row],[Bildname]]<>\"\",IF(Tabelle_Auswertung[[#This Row],[Punkte]]>0,RANK(Tabelle_Auswertung[[#This Row],[Punkte]],[Punkte],0),\" - \"),\" - \")","v":" - "}," - - -",null,{"$f":"IF(Tabelle_Auswertung[[#This Row],[Platz]]=1,CONCATENATE(Tabelle_Auswertung[[#This Row],[Bildname]],\" von \",Tabelle_Auswertung[[#This Row],[Autor(in)]]),\"\")","v":""},{"$f":"IF(Tabelle_Auswertung[[#This Row],[Platz]]=2,CONCATENATE(Tabelle_Auswertung[[#This Row],[Bildname]],\" von \",Tabelle_Auswertung[[#This Row],[Autor(in)]]),\"\")","v":""},{"$f":"IF(Tabelle_Auswertung[[#This Row],[Platz]]=3,CONCATENATE(Tabelle_Auswertung[[#This Row],[Bildname]],\" von \",Tabelle_Auswertung[[#This Row],[Autor(in)]]),\"\")","v":""},{"$f":"IF(Tabelle_Auswertung[[#This Row],[Platz]]=4,CONCATENATE(Tabelle_Auswertung[[#This Row],[Bildname]],\" von \",Tabelle_Auswertung[[#This Row],[Autor(in)]]),\"\")","v":""},{"$f":"IF(Tabelle_Auswertung[[#This Row],[Platz]]=5,CONCATENATE(Tabelle_Auswertung[[#This Row],[Bildname]],\" von \",Tabelle_Auswertung[[#This Row],[Autor(in)]]),\"\")","v":""},{"$f":"IF(Tabelle_Auswertung[[#This Row],[Platz]]=6,CONCATENATE(Tabelle_Auswertung[[#This Row],[Bildname]],\" von \",Tabelle_Auswertung[[#This Row],[Autor(in)]]),\"\")","v":""},{"$f":"IF(Tabelle_Auswertung[[#This Row],[Platz]]=7,CONCATENATE(Tabelle_Auswertung[[#This Row],[Bildname]],\" von \",Tabelle_Auswertung[[#This Row],[Autor(in)]]),\"\")","v":""},{"$f":"IF(Tabelle_Auswertung[[#This Row],[Platz]]=8,CONCATENATE(Tabelle_Auswertung[[#This Row],[Bildname]],\" von \",Tabelle_Auswertung[[#This Row],[Autor(in)]]),\"\")","v":""},{"$f":"IF(Tabelle_Auswertung[[#This Row],[Platz]]=9,CONCATENATE(Tabelle_Auswertung[[#This Row],[Bildname]],\" von \",Tabelle_Auswertung[[#This Row],[Autor(in)]]),\"\")","v":""},{"$f":"IF(Tabelle_Auswertung[[#This Row],[Platz]]=10,CONCATENATE(Tabelle_Auswertung[[#This Row],[Bildname]],\" von \",Tabelle_Auswertung[[#This Row],[Autor(in)]]),\"\")","v":""}]
[183,{"$nulls":21},{"$f":"IF(Tabelle_Auswertung[[#This Row],[Bildname]]<>\"\",\n    IF(Tabelle_Auswertung[[#This Row],[abwesend]]=\"ja\",\n        SUM(Tabelle_Auswertung[[#This Row],[Juror 1]:[Juror 20]])/COUNT(Tabelle_Auswertung[[#This Row],[Juror 1]:[Juror 20]])*(COUNT(Tabelle_Auswertung[[#This Row],[Juror 1]:[Juror 20]])-1),\n        SUM(Tabelle_Auswertung[[#This Row],[Juror 1]:[Juror 20]])\n    ),\n\" - \")","v":" - "},{"$f":"IF(Tabelle_Auswertung[[#This Row],[Bildname]]<>\"\",IF(Tabelle_Auswertung[[#This Row],[Punkte]]>0,AVERAGE(Tabelle_Auswertung[[#This Row],[Juror 1]:[Juror 20]]),\" - \"),\" - \")","v":" - "},{"$f":"IF(Tabelle_Auswertung[[#This Row],[Bildname]]<>\"\",IF(Tabelle_Auswertung[[#This Row],[Punkte]]>0,RANK(Tabelle_Auswertung[[#This Row],[Punkte]],[Punkte],0),\" - \"),\" - \")","v":" - "}," - - -",null,{"$f":"IF(Tabelle_Auswertung[[#This Row],[Platz]]=1,CONCATENATE(Tabelle_Auswertung[[#This Row],[Bildname]],\" von \",Tabelle_Auswertung[[#This Row],[Autor(in)]]),\"\")","v":""},{"$f":"IF(Tabelle_Auswertung[[#This Row],[Platz]]=2,CONCATENATE(Tabelle_Auswertung[[#This Row],[Bildname]],\" von \",Tabelle_Auswertung[[#This Row],[Autor(in)]]),\"\")","v":""},{"$f":"IF(Tabelle_Auswertung[[#This Row],[Platz]]=3,CONCATENATE(Tabelle_Auswertung[[#This Row],[Bildname]],\" von \",Tabelle_Auswertung[[#This Row],[Autor(in)]]),\"\")","v":""},{"$f":"IF(Tabelle_Auswertung[[#This Row],[Platz]]=4,CONCATENATE(Tabelle_Auswertung[[#This Row],[Bildname]],\" von \",Tabelle_Auswertung[[#This Row],[Autor(in)]]),\"\")","v":""},{"$f":"IF(Tabelle_Auswertung[[#This Row],[Platz]]=5,CONCATENATE(Tabelle_Auswertung[[#This Row],[Bildname]],\" von \",Tabelle_Auswertung[[#This Row],[Autor(in)]]),\"\")","v":""},{"$f":"IF(Tabelle_Auswertung[[#This Row],[Platz]]=6,CONCATENATE(Tabelle_Auswertung[[#This Row],[Bildname]],\" von \",Tabelle_Auswertung[[#This Row],[Autor(in)]]),\"\")","v":""},{"$f":"IF(Tabelle_Auswertung[[#This Row],[Platz]]=7,CONCATENATE(Tabelle_Auswertung[[#This Row],[Bildname]],\" von \",Tabelle_Auswertung[[#This Row],[Autor(in)]]),\"\")","v":""},{"$f":"IF(Tabelle_Auswertung[[#This Row],[Platz]]=8,CONCATENATE(Tabelle_Auswertung[[#This Row],[Bildname]],\" von \",Tabelle_Auswertung[[#This Row],[Autor(in)]]),\"\")","v":""},{"$f":"IF(Tabelle_Auswertung[[#This Row],[Platz]]=9,CONCATENATE(Tabelle_Auswertung[[#This Row],[Bildname]],\" von \",Tabelle_Auswertung[[#This Row],[Autor(in)]]),\"\")","v":""},{"$f":"IF(Tabelle_Auswertung[[#This Row],[Platz]]=10,CONCATENATE(Tabelle_Auswertung[[#This Row],[Bildname]],\" von \",Tabelle_Auswertung[[#This Row],[Autor(in)]]),\"\")","v":""}]
[184,{"$nulls":21},{"$f":"IF(Tabelle_Auswertung[[#This Row],[Bildname]]<>\"\",\n    IF(Tabelle_Auswertung[[#This Row],[abwesend]]=\"ja\",\n        SUM(Tabelle_Auswertung[[#This Row],[Juror 1]:[Juror 20]])/COUNT(Tabelle_Auswertung[[#This Row],[Juror 1]:[Juror 20]])*(COUNT(Tabelle_Auswertung[[#This Row],[Juror 1]:[Juror 20]])-1),\n        SUM(Tabelle_Auswertung[[#This Row],[Juror 1]:[Juror 20]])\n    ),\n\" - \")","v":" - "},{"$f":"IF(Tabelle_Auswertung[[#This Row],[Bildname]]<>\"\",IF(Tabelle_Auswertung[[#This Row],[Punkte]]>0,AVERAGE(Tabelle_Auswertung[[#This Row],[Juror 1]:[Juror 20]]),\" - \"),\" - \")","v":" - "},{"$f":"IF(Tabelle_Auswertung[[#This Row],[Bildname]]<>\"\",IF(Tabelle_Auswertung[[#This Row],[Punkte]]>0,RANK(Tabelle_Auswertung[[#This Row],[Punkte]],[Punkte],0),\" - \"),\" - \")","v":" - "}," - - -",null,{"$f":"IF(Tabelle_Auswertung[[#This Row],[Platz]]=1,CONCATENATE(Tabelle_Auswertung[[#This Row],[Bildname]],\" von \",Tabelle_Auswertung[[#This Row],[Autor(in)]]),\"\")","v":""},{"$f":"IF(Tabelle_Auswertung[[#This Row],[Platz]]=2,CONCATENATE(Tabelle_Auswertung[[#This Row],[Bildname]],\" von \",Tabelle_Auswertung[[#This Row],[Autor(in)]]),\"\")","v":""},{"$f":"IF(Tabelle_Auswertung[[#This Row],[Platz]]=3,CONCATENATE(Tabelle_Auswertung[[#This Row],[Bildname]],\" von \",Tabelle_Auswertung[[#This Row],[Autor(in)]]),\"\")","v":""},{"$f":"IF(Tabelle_Auswertung[[#This Row],[Platz]]=4,CONCATENATE(Tabelle_Auswertung[[#This Row],[Bildname]],\" von \",Tabelle_Auswertung[[#This Row],[Autor(in)]]),\"\")","v":""},{"$f":"IF(Tabelle_Auswertung[[#This Row],[Platz]]=5,CONCATENATE(Tabelle_Auswertung[[#This Row],[Bildname]],\" von \",Tabelle_Auswertung[[#This Row],[Autor(in)]]),\"\")","v":""},{"$f":"IF(Tabelle_Auswertung[[#This Row],[Platz]]=6,CONCATENATE(Tabelle_Auswertung[[#This Row],[Bildname]],\" von \",Tabelle_Auswertung[[#This Row],[Autor(in)]]),\"\")","v":""},{"$f":"IF(Tabelle_Auswertung[[#This Row],[Platz]]=7,CONCATENATE(Tabelle_Auswertung[[#This Row],[Bildname]],\" von \",Tabelle_Auswertung[[#This Row],[Autor(in)]]),\"\")","v":""},{"$f":"IF(Tabelle_Auswertung[[#This Row],[Platz]]=8,CONCATENATE(Tabelle_Auswertung[[#This Row],[Bildname]],\" von \",Tabelle_Auswertung[[#This Row],[Autor(in)]]),\"\")","v":""},{"$f":"IF(Tabelle_Auswertung[[#This Row],[Platz]]=9,CONCATENATE(Tabelle_Auswertung[[#This Row],[Bildname]],\" von \",Tabelle_Auswertung[[#This Row],[Autor(in)]]),\"\")","v":""},{"$f":"IF(Tabelle_Auswertung[[#This Row],[Platz]]=10,CONCATENATE(Tabelle_Auswertung[[#This Row],[Bildname]],\" von \",Tabelle_Auswertung[[#This Row],[Autor(in)]]),\"\")","v":""}]
[185,{"$nulls":21},{"$f":"IF(Tabelle_Auswertung[[#This Row],[Bildname]]<>\"\",\n    IF(Tabelle_Auswertung[[#This Row],[abwesend]]=\"ja\",\n        SUM(Tabelle_Auswertung[[#This Row],[Juror 1]:[Juror 20]])/COUNT(Tabelle_Auswertung[[#This Row],[Juror 1]:[Juror 20]])*(COUNT(Tabelle_Auswertung[[#This Row],[Juror 1]:[Juror 20]])-1),\n        SUM(Tabelle_Auswertung[[#This Row],[Juror 1]:[Juror 20]])\n    ),\n\" - \")","v":" - "},{"$f":"IF(Tabelle_Auswertung[[#This Row],[Bildname]]<>\"\",IF(Tabelle_Auswertung[[#This Row],[Punkte]]>0,AVERAGE(Tabelle_Auswertung[[#This Row],[Juror 1]:[Juror 20]]),\" - \"),\" - \")","v":" - "},{"$f":"IF(Tabelle_Auswertung[[#This Row],[Bildname]]<>\"\",IF(Tabelle_Auswertung[[#This Row],[Punkte]]>0,RANK(Tabelle_Auswertung[[#This Row],[Punkte]],[Punkte],0),\" - \"),\" - \")","v":" - "}," - - -",null,{"$f":"IF(Tabelle_Auswertung[[#This Row],[Platz]]=1,CONCATENATE(Tabelle_Auswertung[[#This Row],[Bildname]],\" von \",Tabelle_Auswertung[[#This Row],[Autor(in)]]),\"\")","v":""},{"$f":"IF(Tabelle_Auswertung[[#This Row],[Platz]]=2,CONCATENATE(Tabelle_Auswertung[[#This Row],[Bildname]],\" von \",Tabelle_Auswertung[[#This Row],[Autor(in)]]),\"\")","v":""},{"$f":"IF(Tabelle_Auswertung[[#This Row],[Platz]]=3,CONCATENATE(Tabelle_Auswertung[[#This Row],[Bildname]],\" von \",Tabelle_Auswertung[[#This Row],[Autor(in)]]),\"\")","v":""},{"$f":"IF(Tabelle_Auswertung[[#This Row],[Platz]]=4,CONCATENATE(Tabelle_Auswertung[[#This Row],[Bildname]],\" von \",Tabelle_Auswertung[[#This Row],[Autor(in)]]),\"\")","v":""},{"$f":"IF(Tabelle_Auswertung[[#This Row],[Platz]]=5,CONCATENATE(Tabelle_Auswertung[[#This Row],[Bildname]],\" von \",Tabelle_Auswertung[[#This Row],[Autor(in)]]),\"\")","v":""},{"$f":"IF(Tabelle_Auswertung[[#This Row],[Platz]]=6,CONCATENATE(Tabelle_Auswertung[[#This Row],[Bildname]],\" von \",Tabelle_Auswertung[[#This Row],[Autor(in)]]),\"\")","v":""},{"$f":"IF(Tabelle_Auswertung[[#This Row],[Platz]]=7,CONCATENATE(Tabelle_Auswertung[[#This Row],[Bildname]],\" von \",Tabelle_Auswertung[[#This Row],[Autor(in)]]),\"\")","v":""},{"$f":"IF(Tabelle_Auswertung[[#This Row],[Platz]]=8,CONCATENATE(Tabelle_Auswertung[[#This Row],[Bildname]],\" von \",Tabelle_Auswertung[[#This Row],[Autor(in)]]),\"\")","v":""},{"$f":"IF(Tabelle_Auswertung[[#This Row],[Platz]]=9,CONCATENATE(Tabelle_Auswertung[[#This Row],[Bildname]],\" von \",Tabelle_Auswertung[[#This Row],[Autor(in)]]),\"\")","v":""},{"$f":"IF(Tabelle_Auswertung[[#This Row],[Platz]]=10,CONCATENATE(Tabelle_Auswertung[[#This Row],[Bildname]],\" von \",Tabelle_Auswertung[[#This Row],[Autor(in)]]),\"\")","v":""}]
[186,{"$nulls":21},{"$f":"IF(Tabelle_Auswertung[[#This Row],[Bildname]]<>\"\",\n    IF(Tabelle_Auswertung[[#This Row],[abwesend]]=\"ja\",\n        SUM(Tabelle_Auswertung[[#This Row],[Juror 1]:[Juror 20]])/COUNT(Tabelle_Auswertung[[#This Row],[Juror 1]:[Juror 20]])*(COUNT(Tabelle_Auswertung[[#This Row],[Juror 1]:[Juror 20]])-1),\n        SUM(Tabelle_Auswertung[[#This Row],[Juror 1]:[Juror 20]])\n    ),\n\" - \")","v":" - "},{"$f":"IF(Tabelle_Auswertung[[#This Row],[Bildname]]<>\"\",IF(Tabelle_Auswertung[[#This Row],[Punkte]]>0,AVERAGE(Tabelle_Auswertung[[#This Row],[Juror 1]:[Juror 20]]),\" - \"),\" - \")","v":" - "},{"$f":"IF(Tabelle_Auswertung[[#This Row],[Bildname]]<>\"\",IF(Tabelle_Auswertung[[#This Row],[Punkte]]>0,RANK(Tabelle_Auswertung[[#This Row],[Punkte]],[Punkte],0),\" - \"),\" - \")","v":" - "}," - - -",null,{"$f":"IF(Tabelle_Auswertung[[#This Row],[Platz]]=1,CONCATENATE(Tabelle_Auswertung[[#This Row],[Bildname]],\" von \",Tabelle_Auswertung[[#This Row],[Autor(in)]]),\"\")","v":""},{"$f":"IF(Tabelle_Auswertung[[#This Row],[Platz]]=2,CONCATENATE(Tabelle_Auswertung[[#This Row],[Bildname]],\" von \",Tabelle_Auswertung[[#This Row],[Autor(in)]]),\"\")","v":""},{"$f":"IF(Tabelle_Auswertung[[#This Row],[Platz]]=3,CONCATENATE(Tabelle_Auswertung[[#This Row],[Bildname]],\" von \",Tabelle_Auswertung[[#This Row],[Autor(in)]]),\"\")","v":""},{"$f":"IF(Tabelle_Auswertung[[#This Row],[Platz]]=4,CONCATENATE(Tabelle_Auswertung[[#This Row],[Bildname]],\" von \",Tabelle_Auswertung[[#This Row],[Autor(in)]]),\"\")","v":""},{"$f":"IF(Tabelle_Auswertung[[#This Row],[Platz]]=5,CONCATENATE(Tabelle_Auswertung[[#This Row],[Bildname]],\" von \",Tabelle_Auswertung[[#This Row],[Autor(in)]]),\"\")","v":""},{"$f":"IF(Tabelle_Auswertung[[#This Row],[Platz]]=6,CONCATENATE(Tabelle_Auswertung[[#This Row],[Bildname]],\" von \",Tabelle_Auswertung[[#This Row],[Autor(in)]]),\"\")","v":""},{"$f":"IF(Tabelle_Auswertung[[#This Row],[Platz]]=7,CONCATENATE(Tabelle_Auswertung[[#This Row],[Bildname]],\" von \",Tabelle_Auswertung[[#This Row],[Autor(in)]]),\"\")","v":""},{"$f":"IF(Tabelle_Auswertung[[#This Row],[Platz]]=8,CONCATENATE(Tabelle_Auswertung[[#This Row],[Bildname]],\" von \",Tabelle_Auswertung[[#This Row],[Autor(in)]]),\"\")","v":""},{"$f":"IF(Tabelle_Auswertung[[#This Row],[Platz]]=9,CONCATENATE(Tabelle_Auswertung[[#This Row],[Bildname]],\" von \",Tabelle_Auswertung[[#This Row],[Autor(in)]]),\"\")","v":""},{"$f":"IF(Tabelle_Auswertung[[#This Row],[Platz]]=10,CONCATENATE(Tabelle_Auswertung[[#This Row],[Bildname]],\" von \",Tabelle_Auswertung[[#This Row],[Autor(in)]]),\"\")","v":""}]

{"sheet":"Statistik nach Autor(in)","index":1,"n_rows":43,"n_cols":11,"rows_kept":43,"merged":[[0,0,3,3]]}
["Statistik",{"$nulls":8},1," - Platz 1"]
[{"$nulls":9},2," - Platz 2"]
[{"$nulls":9},3," - Platz 3"]
[{"$nulls":9}," 4-10"," - Top 10"]
["Autor(in)","Punkte","Platz","Teilnahme","1ster","2ter","3ter","TOP 10"]
[{"$f":"IF(AND(Fotografen!$A24<>\"\",Fotografen!$A24<>\" - - -\"),Fotografen!$A24,\"\")","v":"Oliver von Guérard"},{"$f":"IF(Tabelle_Statistik[[#This Row],[Teilnahme]]=\"ja\",SUMIF(Tabelle_Auswertung[Autor(in)],Tabelle_Statistik[[#This Row],[Autor(in)]],Tabelle_Auswertung[Punkte]),IF(Tabelle_Statistik[[#This Row],[Autor(in)]]<>\"\",\" - \",\"\"))","v":317},{"$f":"IF(Tabelle_Statistik[[#This Row],[Teilnahme]]=\"ja\",RANK(Tabelle_Statistik[[#This Row],[Punkte]],[Punkte],0),IF(Tabelle_Statistik[[#This Row],[Autor(in)]]<>\"\",\" - \",\"\"))","v":1},{"$f":"IF(Tabelle_Statistik[[#This Row],[Autor(in)]]<>\"\",IF(COUNTIF(Tabelle_Auswertung[Autor(in)],Tabelle_Statistik[[#This Row],[Autor(in)]])>0,\"ja\",\"nein\"),\"\")","v":"ja"},{"$f":"IF(Tabelle_Statistik[[#This Row],[Platz]]=1,Tabelle_Statistik[[#This Row],[Autor(in)]],\"\")","v":"Oliver von Guérard"},{"$f":"IF(Tabelle_Statistik[[#This Row],[Platz]]=2,Tabelle_Statistik[[#This Row],[Autor(in)]],\"\")","v":""},{"$f":"IF(Tabelle_Statistik[[#This Row],[Platz]]=3,Tabelle_Statistik[[#This Row],[Autor(in)]],\"\")","v":""},{"$f":"IF(Tabelle_Statistik[[#This Row],[Platz]]<11,Tabelle_Statistik[[#This Row],[Autor(in)]],\"\")","v":"Oliver von Guérard"}]
[{"$f":"IF(AND(Fotografen!$A27<>\"\",Fotografen!$A27<>\" - - -\"),Fotografen!$A27,\"\")","v":"Susanne Deinhardt"},{"$f":"IF(Tabelle_Statistik[[#This Row],[Teilnahme]]=\"ja\",SUMIF(Tabelle_Auswertung[Autor(in)],Tabelle_Statistik[[#This Row],[Autor(in)]],Tabelle_Auswertung[Punkte]),IF(Tabelle_Statistik[[#This Row],[Autor(in)]]<>\"\",\" - \",\"\"))","v":316.75},{"$f":"IF(Tabelle_Statistik[[#This Row],[Teilnahme]]=\"ja\",RANK(Tabelle_Statistik[[#This Row],[Punkte]],[Punkte],0),IF(Tabelle_Statistik[[#This Row],[Autor(in)]]<>\"\",\" - \",\"\"))","v":2},{"$f":"IF(Tabelle_Statistik[[#This Row],[Autor(in)]]<>\"\",IF(COUNTIF(Tabelle_Auswertung[Autor(in)],Tabelle_Statistik[[#This Row],[Autor(in)]])>0,\"ja\",\"nein\"),\"\")","v":"ja"},{"$f":"IF(Tabelle_Statistik[[#This Row],[Platz]]=1,Tabelle_Statistik[[#This Row],[Autor(in)]],\"\")","v":""},{"$f":"IF(Tabelle_Statistik[[#This Row],[Platz]]=2,Tabelle_Statistik[[#This Row],[Autor(in)]],\"\")","v":"Susanne Deinhardt"},{"$f":"IF(Tabelle_Statistik[[#This Row],[Platz]]=3,Tabelle_Statistik[[#This Row],[Autor(in)]],\"\")","v":""},{"$f":"IF(Tabelle_Statistik[[#This Row],[Platz]]<11,Tabelle_Statistik[[#This Row],[Autor(in)]],\"\")","v":"Susanne Deinhardt"}]
[{"$f":"IF(AND(Fotografen!$A8<>\"\",Fotografen!$A8<>\" - - -\"),Fotografen!$A8,\"\")","v":"Chris Finsterer"},{"$f":"IF(Tabelle_Statistik[[#This Row],[Teilnahme]]=\"ja\",SUMIF(Tabelle_Auswertung[Autor(in)],Tabelle_Statistik[[#This Row],[Autor(in)]],Tabelle_Auswertung[Punkte]),IF(Tabelle_Statistik[[#This Row],[Autor(in)]]<>\"\",\" - \",\"\"))","v":312},{"$f":"IF(Tabelle_Statistik[[#This Row],[Teilnahme]]=\"ja\",RANK(Tabelle_Statistik[[#This Row],[Punkte]],[Punkte],0),IF(Tabelle_Statistik[[#This Row],[Autor(in)]]<>\"\",\" - \",\"\"))","v":3},{"$f":"IF(Tabelle_Statistik[[#This Row],[Autor(in)]]<>\"\",IF(COUNTIF(Tabelle_Auswertung[Autor(in)],Tabelle_Statistik[[#This Row],[Autor(in)]])>0,\"ja\",\"nein\"),\"\")","v":"ja"},{"$f":"IF(Tabelle_Statistik[[#This Row],[Platz]]=1,Tabelle_Statistik[[#This Row],[Autor(in)]],\"\")","v":""},{"$f":"IF(Tabelle_Statistik[[#This Row],[Platz]]=2,Tabelle_Statistik[[#This Row],[Autor(in)]],\"\")","v":""},{"$f":"IF(Tabelle_Statistik[[#This Row],[Platz]]=3,Tabelle_Statistik[[#This Row],[Autor(in)]],\"\")","v":"Chris Finsterer"},{"$f":"IF(Tabelle_Statistik[[#This Row],[Platz]]<11,Tabelle_Statistik[[#This Row],[Autor(in)]],\"\")","v":"Chris Finsterer"}]
[{"$f":"IF(AND(Fotografen!$A17<>\"\",Fotografen!$A17<>\" - - -\"),Fotografen!$A17,\"\")","v":"Jan Grünler"},{"$f":"IF(Tabelle_Statistik[[#This Row],[Teilnahme]]=\"ja\",SUMIF(Tabelle_Auswertung[Autor(in)],Tabelle_Statistik[[#This Row],[Autor(in)]],Tabelle_Auswertung[Punkte]),IF(Tabelle_Statistik[[#This Row],[Autor(in)]]<>\"\",\" - \",\"\"))","v":312},{"$f":"IF(Tabelle_Statistik[[#This Row],[Teilnahme]]=\"ja\",RANK(Tabelle_Statistik[[#This Row],[Punkte]],[Punkte],0),IF(Tabelle_Statistik[[#This Row],[Autor(in)]]<>\"\",\" - \",\"\"))","v":3},{"$f":"IF(Tabelle_Statistik[[#This Row],[Autor(in)]]<>\"\",IF(COUNTIF(Tabelle_Auswertung[Autor(in)],Tabelle_Statistik[[#This Row],[Autor(in)]])>0,\"ja\",\"nein\"),\"\")","v":"ja"},{"$f":"IF(Tabelle_Statistik[[#This Row],[Platz]]=1,Tabelle_Statistik[[#This Row],[Autor(in)]],\"\")","v":""},{"$f":"IF(Tabelle_Statistik[[#This Row],[Platz]]=2,Tabelle_Statistik[[#This Row],[Autor(in)]],\"\")","v":""},{"$f":"IF(Tabelle_Statistik[[#This Row],[Platz]]=3,Tabelle_Statistik[[#This Row],[Autor(in)]],\"\")","v":"Jan Grünler"},{"$f":"IF(Tabelle_Statistik[[#This Row],[Platz]]<11,Tabelle_Statistik[[#This Row],[Autor(in)]],\"\")","v":"Jan Grünler"}]
[{"$f":"IF(AND(Fotografen!$A23<>\"\",Fotografen!$A23<>\" - - -\"),Fotografen!$A23,\"\")","v":"Nadja Cassim"},{"$f":"IF(Tabelle_Statistik[[#This Row],[Teilnahme]]=\"ja\",SUMIF(Tabelle_Auswertung[Autor(in)],Tabelle_Statistik[[#This Row],[Autor(in)]],Tabelle_Auswertung[Punkte]),IF(Tabelle_Statistik[[#This Row],[Autor(in)]]<>\"\",\" - \",\"\"))","v":311},{"$f":"IF(Tabelle_Statistik[[#This Row],[Teilnahme]]=\"ja\",RANK(Tabelle_Statistik[[#This Row],[Punkte]],[Punkte],0),IF(Tabelle_Statistik[[#This Row],[Autor(in)]]<>\"\",\" - \",\"\"))","v":5},{"$f":"IF(Tabelle_Statistik[[#This Row],[Autor(in)]]<>\"\",IF(COUNTIF(Tabelle_Auswertung[Autor(in)],Tabelle_Statistik[[#This Row],[Autor(in)]])>0,\"ja\",\"nein\"),\"\")","v":"ja"},{"$f":"IF(Tabelle_Statistik[[#This Row],[Platz]]=1,Tabelle_Statistik[[#This Row],[Autor(in)]],\"\")","v":""},{"$f":"IF(Tabelle_Statistik[[#This Row],[Platz]]=2,Tabelle_Statistik[[#This Row],[Autor(in)]],\"\")","v":""},{"$f":"IF(Tabelle_Statistik[[#This Row],[Platz]]=3,Tabelle_Statistik[[#This Row],[Autor(in)]],\"\")","v":""},{"$f":"IF(Tabelle_Statistik[[#This Row],[Platz]]<11,Tabelle_Statistik[[#This Row],[Autor(in)]],\"\")","v":"Nadja Cassim"}]
[{"$f":"IF(AND(Fotografen!$A12<>\"\",Fotografen!$A12<>\" - - -\"),Fotografen!$A12,\"\")","v":"Gerhard Rieß"},{"$f":"IF(Tabelle_Statistik[[#This Row],[Teilnahme]]=\"ja\",SUMIF(Tabelle_Auswertung[Autor(in)],Tabelle_Statistik[[#This Row],[Autor(in)]],Tabelle_Auswertung[Punkte]),IF(Tabelle_Statistik[[#This Row],[Autor(in)]]<>\"\",\" - \",\"\"))","v":291},{"$f":"IF(Tabelle_Statistik[[#This Row],[Teilnahme]]=\"ja\",RANK(Tabelle_Statistik[[#This Row],[Punkte]],[Punkte],0),IF(Tabelle_Statistik[[#This Row],[Autor(in)]]<>\"\",\" - \",\"\"))","v":6},{"$f":"IF(Tabelle_Statistik[[#This Row],[Autor(in)]]<>\"\",IF(COUNTIF(Tabelle_Auswertung[Autor(in)],Tabelle_Statistik[[#This Row],[Autor(in)]])>0,\"ja\",\"nein\"),\"\")","v":"ja"},{"$f":"IF(Tabelle_Statistik[[#This Row],[Platz]]=1,Tabelle_Statistik[[#This Row],[Autor(in)]],\"\")","v":""},{"$f":"IF(Tabelle_Statistik[[#This Row],[Platz]]=2,Tabelle_Statistik[[#This Row],[Autor(in)]],\"\")","v":""},{"$f":"IF(Tabelle_Statistik[[#This Row],[Platz]]=3,Tabelle_Statistik[[#This Row],[Autor(in)]],\"\")","v":""},{"$f":"IF(Tabelle_Statistik[[#This Row],[Platz]]<11,Tabelle_Statistik[[#This Row],[Autor(in)]],\"\")","v":"Gerhard Rieß"}]
[{"$f":"IF(AND(Fotografen!$A5<>\"\",Fotografen!$A5<>\" - - -\"),Fotografen!$A5,\"\")","v":"Andreas Toltz"},{"$f":"IF(Tabelle_Statistik[[#This Row],[Teilnahme]]=\"ja\",SUMIF(Tabelle_Auswertung[Autor(in)],Tabelle_Statistik[[#This Row],[Autor(in)]],Tabelle_Auswertung[Punkte]),IF(Tabelle_Statistik[[#This Row],[Autor(in)]]<>\"\",\" - \",\"\"))","v":285.25},{"$f":"IF(Tabelle_Statistik[[#This Row],[Teilnahme]]=\"ja\",RANK(Tabelle_Statistik[[#This Row],[Punkte]],[Punkte],0),IF(Tabelle_Statistik[[#This Row],[Autor(in)]]<>\"\",\" - \",\"\"))","v":7},{"$f":"IF(Tabelle_Statistik[[#This Row],[Autor(in)]]<>\"\",IF(COUNTIF(Tabelle_Auswertung[Autor(in)],Tabelle_Statistik[[#This Row],[Autor(in)]])>0,\"ja\",\"nein\"),\"\")","v":"ja"},{"$f":"IF(Tabelle_Statistik[[#This Row],[Platz]]=1,Tabelle_Statistik[[#This Row],[Autor(in)]],\"\")","v":""},{"$f":"IF(Tabelle_Statistik[[#This Row],[Platz]]=2,Tabelle_Statistik[[#This Row],[Autor(in)]],\"\")","v":""},{"$f":"IF(Tabelle_Statistik[[#This Row],[Platz]]=3,Tabelle_Statistik[[#This Row],[Autor(in)]],\"\")","v":""},{"$f":"IF(Tabelle_Statistik[[#This Row],[Platz]]<11,Tabelle_Statistik[[#This Row],[Autor(in)]],\"\")","v":"Andreas Toltz"}]
[{"$f":"IF(AND(Fotografen!$A6<>\"\",Fotografen!$A6<>\" - - -\"),Fotografen!$A6,\"\")","v":"Antje Finsterer"},{"$f":"IF(Tabelle_Statistik[[#This Row],[Teilnahme]]=\"ja\",SUMIF(Tabelle_Auswertung[Autor(in)],Tabelle_Statistik[[#This Row],[Autor(in)]],Tabelle_Auswertung[Punkte]),IF(Tabelle_Statistik[[#This Row],[Autor(in)]]<>\"\",\" - \",\"\"))","v":264},{"$f":"IF(Tabelle_Statistik[[#This Row],[Teilnahme]]=\"ja\",RANK(Tabelle_Statistik[[#This Row],[Punkte]],[Punkte],0),IF(Tabelle_Statistik[[#This Row],[Autor(in)]]<>\"\",\" - \",\"\"))","v":8},{"$f":"IF(Tabelle_Statistik[[#This Row],[Autor(in)]]<>\"\",IF(COUNTIF(Tabelle_Auswertung[Autor(in)],Tabelle_Statistik[[#This Row],[Autor(in)]])>0,\"ja\",\"nein\"),\"\")","v":"ja"},{"$f":"IF(Tabelle_Statistik[[#This Row],[Platz]]=1,Tabelle_Statistik[[#This Row],[Autor(in)]],\"\")","v":""},{"$f":"IF(Tabelle_Statistik[[#This Row],[Platz]]=2,Tabelle_Statistik[[#This Row],[Autor(in)]],\"\")","v":""},{"$f":"IF(Tabelle_Statistik[[#This Row],[Platz]]=3,Tabelle_Statistik[[#This Row],[Autor(in)]],\"\")","v":""},{"$f":"IF(Tabelle_Statistik[[#This Row],[Platz]]<11,Tabelle_Statistik[[#This Row],[Autor(in)]],\"\")","v":"Antje Finsterer"}]
[{"$f":"IF(AND(Fotografen!$A3<>\"\",Fotografen!$A3<>\" - - -\"),Fotografen!$A3,\"\")","v":"Albrecht Flierl"},{"$f":"IF(Tabelle_Statistik[[#This Row],[Teilnahme]]=\"ja\",SUMIF(Tabelle_Auswertung[Autor(in)],Tabelle_Statistik[[#This Row],[Autor(in)]],Tabelle_Auswertung[Punkte]),IF(Tabelle_Statistik[[#This Row],[Autor(in)]]<>\"\",\" - \",\"\"))","v":254},{"$f":"IF(Tabelle_Statistik[[#This Row],[Teilnahme]]=\"ja\",RANK(Tabelle_Statistik[[#This Row],[Punkte]],[Punkte],0),IF(Tabelle_Statistik[[#This Row],[Autor(in)]]<>\"\",\" - \",\"\"))","v":9},{"$f":"IF(Tabelle_Statistik[[#This Row],[Autor(in)]]<>\"\",IF(COUNTIF(Tabelle_Auswertung[Autor(in)],Tabelle_Statistik[[#This Row],[Autor(in)]])>0,\"ja\",\"nein\"),\"\")","v":"ja"},{"$f":"IF(Tabelle_Statistik[[#This Row],[Platz]]=1,Tabelle_Statistik[[#This Row],[Autor(in)]],\"\")","v":""},{"$f":"IF(Tabelle_Statistik[[#This Row],[Platz]]=2,Tabelle_Statistik[[#This Row],[Autor(in)]],\"\")","v":""},{"$f":"IF(Tabelle_Statistik[[#This Row],[Platz]]=3,Tabelle_Statistik[[#This Row],[Autor(in)]],\"\")","v":""},{"$f":"IF(Tabelle_Statistik[[#This Row],[Platz]]<11,Tabelle_Statistik[[#This Row],[Autor(in)]],\"\")","v":"Albrecht Flierl"}]
[{"$f":"IF(AND(Fotografen!$A9<>\"\",Fotografen!$A9<>\" - - -\"),Fotografen!$A9,\"\")","v":"Claudia Dommel"},{"$f":"IF(Tabelle_Statistik[[#This Row],[Teilnahme]]=\"ja\",SUMIF(Tabelle_Auswertung[Autor(in)],Tabelle_Statistik[[#This Row],[Autor(in)]],Tabelle_Auswertung[Punkte]),IF(Tabelle_Statistik[[#This Row],[Autor(in)]]<>\"\",\" - \",\"\"))","v":210},{"$f":"IF(Tabelle_Statistik[[#This Row],[Teilnahme]]=\"ja\",RANK(Tabelle_Statistik[[#This Row],[Punkte]],[Punkte],0),IF(Tabelle_Statistik[[#This Row],[Autor(in)]]<>\"\",\" - \",\"\"))","v":10},{"$f":"IF(Tabelle_Statistik[[#This Row],[Autor(in)]]<>\"\",IF(COUNTIF(Tabelle_Auswertung[Autor(in)],Tabelle_Statistik[[#This Row],[Autor(in)]])>0,\"ja\",\"nein\"),\"\")","v":"ja"},{"$f":"IF(Tabelle_Statistik[[#This Row],[Platz]]=1,Tabelle_Statistik[[#This Row],[Autor(in)]],\"\")","v":""},{"$f":"IF(Tabelle_Statistik[[#This Row],[Platz]]=2,Tabelle_Statistik[[#This Row],[Autor(in)]],\"\")","v":""},{"$f":"IF(Tabelle_Statistik[[#This Row],[Platz]]=3,Tabelle_Statistik[[#This Row],[Autor(in)]],\"\")","v":""},{"$f":"IF(Tabelle_Statistik[[#This Row],[Platz]]<11,Tabelle_Statistik[[#This Row],[Autor(in)]],\"\")","v":"Claudia Dommel"}]
[{"$f":"IF(AND(Fotografen!$A2<>\"\",Fotografen!$A2<>\" - - -\"),Fotografen!$A2,\"\")","v":""},{"$f":"IF(Tabelle_Statistik[[#This Row],[Teilnahme]]=\"ja\",SUMIF(Tabelle_Auswertung[Autor(in)],Tabelle_Statistik[[#This Row],[Autor(in)]],Tabelle_Auswertung[Punkte]),IF(Tabelle_Statistik[[#This Row],[Autor(in)]]<>\"\",\" - \",\"\"))","v":""},{"$f":"IF(Tabelle_Statistik[[#This Row],[Teilnahme]]=\"ja\",RANK(Tabelle_Statistik[[#This Row],[Punkte]],[Punkte],0),IF(Tabelle_Statistik[[#This Row],[Autor(in)]]<>\"\",\" - \",\"\"))","v":""},{"$f":"IF(Tabelle_Statistik[[#This Row],[Autor(in)]]<>\"\",IF(COUNTIF(Tabelle_Auswertung[Autor(in)],Tabelle_Statistik[[#This Row],[Autor(in)]])>0,\"ja\",\"nein\"),\"\")","v":""},{"$f":"IF(Tabelle_Statistik[[#This Row],[Platz]]=1,Tabelle_Statistik[[#This Row],[Autor(in)]],\"\")","v":""},{"$f":"IF(Tabelle_Statistik[[#This Row],[Platz]]=2,Tabelle_Statistik[[#This Row],[Autor(in)]],\"\")","v":""},{"$f":"IF(Tabelle_Statistik[[#This Row],[Platz]]=3,Tabelle_Statistik[[#This Row],[Autor(in)]],\"\")","v":""},{"$f":"IF(Tabelle_Statistik[[#This Row],[Platz]]<11,Tabelle_Statistik[[#This Row],[Autor(in)]],\"\")","v":""}]
[{"$f":"IF(AND(Fotografen!$A4<>\"\",Fotografen!$A4<>\" - - -\"),Fotografen!$A4,\"\")","v":"Alexander Häberlein"},{"$f":"IF(Tabelle_Statistik[[#This Row],[Teilnahme]]=\"ja\",SUMIF(Tabelle_Auswertung[Autor(in)],Tabelle_Statistik[[#This Row],[Autor(in)]],Tabelle_Auswertung[Punkte]),IF(Tabelle_Statistik[[#This Row],[Autor(in)]]<>\"\",\" - \",\"\"))","v":" - "},{"$f":"IF(Tabelle_Statistik[[#This Row],[Teilnahme]]=\"ja\",RANK(Tabelle_Statistik[[#This Row],[Punkte]],[Punkte],0),IF(Tabelle_Statistik[[#This Row],[Autor(in)]]<>\"\",\" - \",\"\"))","v":" - "},{"$f":"IF(Tabelle_Statistik[[#This Row],[Autor(in)]]<>\"\",IF(COUNTIF(Tabelle_Auswertung[Autor(in)],Tabelle_Statistik[[#This Row],[Autor(in)]])>0,\"ja\",\"nein\"),\"\")","v":"nein"},{"$f":"IF(Tabelle_Statistik[[#This Row],[Platz]]=1,Tabelle_Statistik[[#This Row],[Autor(in)]],\"\")","v":""},{"$f":"IF(Tabelle_Statistik[[#This Row],[Platz]]=2,Tabelle_Statistik[[#This Row],[Autor(in)]],\"\")","v":""},{"$f":"IF(Tabelle_Statistik[[#This Row],[Platz]]=3,Tabelle_Statistik[[#This Row],[Autor(in)]],\"\")","v":""},{"$f":"IF(Tabelle_Statistik[[#This Row],[Platz]]<11,Tabelle_Statistik[[#This Row],[Autor(in)]],\"\")","v":""}]
[{"$f":"IF(AND(Fotografen!$A7<>\"\",Fotografen!$A7<>\" - - -\"),Fotografen!$A7,\"\")","v":"Bernd Kober"},{"$f":"IF(Tabelle_Statistik[[#This Row],[Teilnahme]]=\"ja\",SUMIF(Tabelle_Auswertung[Autor(in)],Tabelle_Statistik[[#This Row],[Autor(in)]],Tabelle_Auswertung[Punkte]),IF(Tabelle_Statistik[[#This Row],[Autor(in)]]<>\"\",\" - \",\"\"))","v":" - "},{"$f":"IF(Tabelle_Statistik[[#This Row],[Teilnahme]]=\"ja\",RANK(Tabelle_Statistik[[#This Row],[Punkte]],[Punkte],0),IF(Tabelle_Statistik[[#This Row],[Autor(in)]]<>\"\",\" - \",\"\"))","v":" - "},{"$f":"IF(Tabelle_Statistik[[#This Row],[Autor(in)]]<>\"\",IF(COUNTIF(Tabelle_Auswertung[Autor(in)],Tabelle_Statistik[[#This Row],[Autor(in)]])>0,\"ja\",\"nein\"),\"\")","v":"nein"},{"$f":"IF(Tabelle_Statistik[[#This Row],[Platz]]=1,Tabelle_Statistik[[#This Row],[Autor(in)]],\"\")","v":""},{"$f":"IF(Tabelle_Statistik[[#This Row],[Platz]]=2,Tabelle_Statistik[[#This Row],[Autor(in)]],\"\")","v":""},{"$f":"IF(Tabelle_Statistik[[#This Row],[Platz]]=3,Tabelle_Statistik[[#This Row],[Autor(in)]],\"\")","v":""},{"$f":"IF(Tabelle_Statistik[[#This Row],[Platz]]<11,Tabelle_Statistik[[#This Row],[Autor(in)]],\"\")","v":""}]
[{"$f":"IF(AND(Fotografen!$A10<>\"\",Fotografen!$A10<>\" - - -\"),Fotografen!$A10,\"\")","v":"Georg Held"},{"$f":"IF(Tabelle_Statistik[[#This Row],[Teilnahme]]=\"ja\",SUMIF(Tabelle_Auswertung[Autor(in)],Tabelle_Statistik[[#This Row],[Autor(in)]],Tabelle_Auswertung[Punkte]),IF(Tabelle_Statistik[[#This Row],[Autor(in)]]<>\"\",\" - \",\"\"))","v":" - "},{"$f":"IF(Tabelle_Statistik[[#This Row],[Teilnahme]]=\"ja\",RANK(Tabelle_Statistik[[#This Row],[Punkte]],[Punkte],0),IF(Tabelle_Statistik[[#This Row],[Autor(in)]]<>\"\",\" - \",\"\"))","v":" - "},{"$f":"IF(Tabelle_Statistik[[#This Row],[Autor(in)]]<>\"\",IF(COUNTIF(Tabelle_Auswertung[Autor(in)],Tabelle_Statistik[[#This Row],[Autor(in)]])>0,\"ja\",\"nein\"),\"\")","v":"nein"},{"$f":"IF(Tabelle_Statistik[[#This Row],[Platz]]=1,Tabelle_Statistik[[#This Row],[Autor(in)]],\"\")","v":""},{"$f":"IF(Tabelle_Statistik[[#This Row],[Platz]]=2,Tabelle_Statistik[[#This Row],[Autor(in)]],\"\")","v":""},{"$f":"IF(Tabelle_Statistik[[#This Row],[Platz]]=3,Tabelle_Statistik[[#This Row],[Autor(in)]],\"\")","v":""},{"$f":"IF(Tabelle_Statistik[[#This Row],[Platz]]<11,Tabelle_Statistik[[#This Row],[Autor(in)]],\"\")","v":""}]
[{"$f":"IF(AND(Fotografen!$A11<>\"\",Fotografen!$A11<>\" - - -\"),Fotografen!$A11,\"\")","v":"Georg Lindörfer"},{"$f":"IF(Tabelle_Statistik[[#This Row],[Teilnahme]]=\"ja\",SUMIF(Tabelle_Auswertung[Autor(in)],Tabelle_Statistik[[#This Row],[Autor(in)]],Tabelle_Auswertung[Punkte]),IF(Tabelle_Statistik[[#This Row],[Autor(in)]]<>\"\",\" - \",\"\"))","v":" - "},{"$f":"IF(Tabelle_Statistik[[#This Row],[Teilnahme]]=\"ja\",RANK(Tabelle_Statistik[[#This Row],[Punkte]],[Punkte],0),IF(Tabelle_Statistik[[#This Row],[Autor(in)]]<>\"\",\" - \",\"\"))","v":" - "},{"$f":"IF(Tabelle_Statistik[[#This Row],[Autor(in)]]<>\"\",IF(COUNTIF(Tabelle_Auswertung[Autor(in)],Tabelle_Statistik[[#This Row],[Autor(in)]])>0,\"ja\",\"nein\"),\"\")","v":"nein"},{"$f":"IF(Tabelle_Statistik[[#This Row],[Platz]]=1,Tabelle_Statistik[[#This Row],[Autor(in)]],\"\")","v":""},{"$f":"IF(Tabelle_Statistik[[#This Row],[Platz]]=2,Tabelle_Statistik[[#This Row],[Autor(in)]],\"\")","v":""},{"$f":"IF(Tabelle_Statistik[[#This Row],[Platz]]=3,Tabelle_Statistik[[#This Row],[Autor(in)]],\"\")","v":""},{"$f":"IF(Tabelle_Statistik[[#This Row],[Platz]]<11,Tabelle_Statistik[[#This Row],[Autor(in)]],\"\")","v":""}]
[{"$f":"IF(AND(Fotografen!$A13<>\"\",Fotografen!$A13<>\" - - -\"),Fotografen!$A13,\"\")","v":"Gert Häberlein"},{"$f":"IF(Tabelle_Statistik[[#This Row],[Teilnahme]]=\"ja\",SUMIF(Tabelle_Auswertung[Autor(in)],Tabelle_Statistik[[#This Row],[Autor(in)]],Tabelle_Auswertung[Punkte]),IF(Tabelle_Statistik[[#This Row],[Autor(in)]]<>\"\",\" - \",\"\"))","v":" - "},{"$f":"IF(Tabelle_Statistik[[#This Row],[Teilnahme]]=\"ja\",RANK(Tabelle_Statistik[[#This Row],[Punkte]],[Punkte],0),IF(Tabelle_Statistik[[#This Row],[Autor(in)]]<>\"\",\" - \",\"\"))","v":" - "},{"$f":"IF(Tabelle_Statistik[[#This Row],[Autor(in)]]<>\"\",IF(COUNTIF(Tabelle_Auswertung[Autor(in)],Tabelle_Statistik[[#This Row],[Autor(in)]])>0,\"ja\",\"nein\"),\"\")","v":"nein"},{"$f":"IF(Tabelle_Statistik[[#This Row],[Platz]]=1,Tabelle_Statistik[[#This Row],[Autor(in)]],\"\")","v":""},{"$f":"IF(Tabelle_Statistik[[#This Row],[Platz]]=2,Tabelle_Statistik[[#This Row],[Autor(in)]],\"\")","v":""},{"$f":"IF(Tabelle_Statistik[[#This Row],[Platz]]=3,Tabelle_Statistik[[#This Row],[Autor(in)]],\"\")","v":""},{"$f":"IF(Tabelle_Statistik[[#This Row],[Platz]]<11,Tabelle_Statistik[[#This Row],[Autor(in)]],\"\")","v":""}]
[{"$f":"IF(AND(Fotografen!$A14<>\"\",Fotografen!$A14<>\" - - -\"),Fotografen!$A14,\"\")","v":"Günter Buckl"},{"$f":"IF(Tabelle_Statistik[[#This Row],[Teilnahme]]=\"ja\",SUMIF(Tabelle_Auswertung[Autor(in)],Tabelle_Statistik[[#This Row],[Autor(in)]],Tabelle_Auswertung[Punkte]),IF(Tabelle_Statistik[[#This Row],[Autor(in)]]<>\"\",\" - \",\"\"))","v":" - "},{"$f":"IF(Tabelle_Statistik[[#This Row],[Teilnahme]]=\"ja\",RANK(Tabelle_Statistik[[#This Row],[Punkte]],[Punkte],0),IF(Tabelle_Statistik[[#This Row],[Autor(in)]]<>\"\",\" - \",\"\"))","v":" - "},{"$f":"IF(Tabelle_Statistik[[#This Row],[Autor(in)]]<>\"\",IF(COUNTIF(Tabelle_Auswertung[Autor(in)],Tabelle_Statistik[[#This Row],[Autor(in)]])>0,\"ja\",\"nein\"),\"\")","v":"nein"},{"$f":"IF(Tabelle_Statistik[[#This Row],[Platz]]=1,Tabelle_Statistik[[#This Row],[Autor(in)]],\"\")","v":""},{"$f":"IF(Tabelle_Statistik[[#This Row],[Platz]]=2,Tabelle_Statistik[[#This Row],[Autor(in)]],\"\")","v":""},{"$f":"IF(Tabelle_Statistik[[#This Row],[Platz]]=3,Tabelle_Statistik[[#This Row],[Autor(in)]],\"\")","v":""},{"$f":"IF(Tabelle_Statistik[[#This Row],[Platz]]<11,Tabelle_Statistik[[#This Row],[Autor(in)]],\"\")","v":""}]
[{"$f":"IF(AND(Fotografen!$A15<>\"\",Fotografen!$A15<>\" - - -\"),Fotografen!$A15,\"\")","v":"Günter Wieser"},{"$f":"IF(Tabelle_Statistik[[#This Row],[Teilnahme]]=\"ja\",SUMIF(Tabelle_Auswertung[Autor(in)],Tabelle_Statistik[[#This Row],[Autor(in)]],Tabelle_Auswertung[Punkte]),IF(Tabelle_Statistik[[#This Row],[Autor(in)]]<>\"\",\" - \",\"\"))","v":" - "},{"$f":"IF(Tabelle_Statistik[[#This Row],[Teilnahme]]=\"ja\",RANK(Tabelle_Statistik[[#This Row],[Punkte]],[Punkte],0),IF(Tabelle_Statistik[[#This Row],[Autor(in)]]<>\"\",\" - \",\"\"))","v":" - "},{"$f":"IF(Tabelle_Statistik[[#This Row],[Autor(in)]]<>\"\",IF(COUNTIF(Tabelle_Auswertung[Autor(in)],Tabelle_Statistik[[#This Row],[Autor(in)]])>0,\"ja\",\"nein\"),\"\")","v":"nein"},{"$f":"IF(Tabelle_Statistik[[#This Row],[Platz]]=1,Tabelle_Statistik[[#This Row],[Autor(in)]],\"\")","v":""},{"$f":"IF(Tabelle_Statistik[[#This Row],[Platz]]=2,Tabelle_Statistik[[#This Row],[Autor(in)]],\"\")","v":""},{"$f":"IF(Tabelle_Statistik[[#This Row],[Platz]]=3,Tabelle_Statistik[[#This Row],[Autor(in)]],\"\")","v":""},{"$f":"IF(Tabelle_Statistik[[#This Row],[Platz]]<11,Tabelle_Statistik[[#This Row],[Autor(in)]],\"\")","v":""}]
[{"$f":"IF(AND(Fotografen!$A16<>\"\",Fotografen!$A16<>\" - - -\"),Fotografen!$A16,\"\")","v":"Günther Arold"},{"$f":"IF(Tabelle_Statistik[[#This Row],[Teilnahme]]=\"ja\",SUMIF(Tabelle_Auswertung[Autor(in)],Tabelle_Statistik[[#This Row],[Autor(in)]],Tabelle_Auswertung[Punkte]),IF(Tabelle_Statistik[[#This Row],[Autor(in)]]<>\"\",\" - \",\"\"))","v":" - "},{"$f":"IF(Tabelle_Statistik[[#This Row],[Teilnahme]]=\"ja\",RANK(Tabelle_Statistik[[#This Row],[Punkte]],[Punkte],0),IF(Tabelle_Statistik[[#This Row],[Autor(in)]]<>\"\",\" - \",\"\"))","v":" - "},{"$f":"IF(Tabelle_Statistik[[#This Row],[Autor(in)]]<>\"\",IF(COUNTIF(Tabelle_Auswertung[Autor(in)],Tabelle_Statistik[[#This Row],[Autor(in)]])>0,\"ja\",\"nein\"),\"\")","v":"nein"},{"$f":"IF(Tabelle_Statistik[[#This Row],[Platz]]=1,Tabelle_Statistik[[#This Row],[Autor(in)]],\"\")","v":""},{"$f":"IF(Tabelle_Statistik[[#This Row],[Platz]]=2,Tabelle_Statistik[[#This Row],[Autor(in)]],\"\")","v":""},{"$f":"IF(Tabelle_Statistik[[#This Row],[Platz]]=3,Tabelle_Statistik[[#This Row],[Autor(in)]],\"\")","v":""},{"$f":"IF(Tabelle_Statistik[[#This Row],[Platz]]<11,Tabelle_Statistik[[#This Row],[Autor(in)]],\"\")","v":""}]
[{"$f":"IF(AND(Fotografen!$A18<>\"\",Fotografen!$A18<>\" - - -\"),Fotografen!$A18,\"\")","v":"Jürgen Abt"},{"$f":"IF(Tabelle_Statistik[[#This Row],[Teilnahme]]=\"ja\",SUMIF(Tabelle_Auswertung[Autor(in)],Tabelle_Statistik[[#This Row],[Autor(in)]],Tabelle_Auswertung[Punkte]),IF(Tabelle_Statistik[[#This Row],[Autor(in)]]<>\"\",\" - \",\"\"))","v":" - "},{"$f":"IF(Tabelle_Statistik[[#This Row],[Teilnahme]]=\"ja\",RANK(Tabelle_Statistik[[#This Row],[Punkte]],[Punkte],0),IF(Tabelle_Statistik[[#This Row],[Autor(in)]]<>\"\",\" - \",\"\"))","v":" - "},{"$f":"IF(Tabelle_Statistik[[#This Row],[Autor(in)]]<>\"\",IF(COUNTIF(Tabelle_Auswertung[Autor(in)],Tabelle_Statistik[[#This Row],[Autor(in)]])>0,\"ja\",\"nein\"),\"\")","v":"nein"},{"$f":"IF(Tabelle_Statistik[[#This Row],[Platz]]=1,Tabelle_Statistik[[#This Row],[Autor(in)]],\"\")","v":""},{"$f":"IF(Tabelle_Statistik[[#This Row],[Platz]]=2,Tabelle_Statistik[[#This Row],[Autor(in)]],\"\")","v":""},{"$f":"IF(Tabelle_Statistik[[#This Row],[Platz]]=3,Tabelle_Statistik[[#This Row],[Autor(in)]],\"\")","v":""},{"$f":"IF(Tabelle_Statistik[[#This Row],[Platz]]<11,Tabelle_Statistik[[#This Row],[Autor(in)]],\"\")","v":""}]
[{"$f":"IF(AND(Fotografen!$A19<>\"\",Fotografen!$A19<>\" - - -\"),Fotografen!$A19,\"\")","v":"Klaus Leitloff"},{"$f":"IF(Tabelle_Statistik[[#This Row],[Teilnahme]]=\"ja\",SUMIF(Tabelle_Auswertung[Autor(in)],Tabelle_Statistik[[#This Row],[Autor(in)]],Tabelle_Auswertung[Punkte]),IF(Tabelle_Statistik[[#This Row],[Autor(in)]]<>\"\",\" - \",\"\"))","v":" - "},{"$f":"IF(Tabelle_Statistik[[#This Row],[Teilnahme]]=\"ja\",RANK(Tabelle_Statistik[[#This Row],[Punkte]],[Punkte],0),IF(Tabelle_Statistik[[#This Row],[Autor(in)]]<>\"\",\" - \",\"\"))","v":" - "},{"$f":"IF(Tabelle_Statistik[[#This Row],[Autor(in)]]<>\"\",IF(COUNTIF(Tabelle_Auswertung[Autor(in)],Tabelle_Statistik[[#This Row],[Autor(in)]])>0,\"ja\",\"nein\"),\"\")","v":"nein"},{"$f":"IF(Tabelle_Statistik[[#This Row],[Platz]]=1,Tabelle_Statistik[[#This Row],[Autor(in)]],\"\")","v":""},{"$f":"IF(Tabelle_Statistik[[#This Row],[Platz]]=2,Tabelle_Statistik[[#This Row],[Autor(in)]],\"\")","v":""},{"$f":"IF(Tabelle_Statistik[[#This Row],[Platz]]=3,Tabelle_Statistik[[#This Row],[Autor(in)]],\"\")","v":""},{"$f":"IF(Tabelle_Statistik[[#This Row],[Platz]]<11,Tabelle_Statistik[[#This Row],[Autor(in)]],\"\")","v":""}]
[{"$f":"IF(AND(Fotografen!$A20<>\"\",Fotografen!$A20<>\" - - -\"),Fotografen!$A20,\"\")","v":"Klaus Lindörfer"},{"$f":"IF(Tabelle_Statistik[[#This Row],[Teilnahme]]=\"ja\",SUMIF(Tabelle_Auswertung[Autor(in)],Tabelle_Statistik[[#This Row],[Autor(in)]],Tabelle_Auswertung[Punkte]),IF(Tabelle_Statistik[[#This Row],[Autor(in)]]<>\"\",\" - \",\"\"))","v":" - "},{"$f":"IF(Tabelle_Statistik[[#This Row],[Teilnahme]]=\"ja\",RANK(Tabelle_Statistik[[#This Row],[Punkte]],[Punkte],0),IF(Tabelle_Statistik[[#This Row],[Autor(in)]]<>\"\",\" - \",\"\"))","v":" - "},{"$f":"IF(Tabelle_Statistik[[#This Row],[Autor(in)]]<>\"\",IF(COUNTIF(Tabelle_Auswertung[Autor(in)],Tabelle_Statistik[[#This Row],[Autor(in)]])>0,\"ja\",\"nein\"),\"\")","v":"nein"},{"$f":"IF(Tabelle_Statistik[[#This Row],[Platz]]=1,Tabelle_Statistik[[#This Row],[Autor(in)]],\"\")","v":""},{"$f":"IF(Tabelle_Statistik[[#This Row],[Platz]]=2,Tabelle_Statistik[[#This Row],[Autor(in)]],\"\")","v":""},{"$f":"IF(Tabelle_Statistik[[#This Row],[Platz]]=3,Tabelle_Statistik[[#This Row],[Autor(in)]],\"\")","v":""},{"$f":"IF(Tabelle_Statistik[[#This Row],[Platz]]<11,Tabelle_Statistik[[#This Row],[Autor(in)]],\"\")","v":""}]
[{"$f":"IF(AND(Fotografen!$A21<>\"\",Fotografen!$A21<>\" - - -\"),Fotografen!$A21,\"\")","v":"Manfred Schwab"},{"$f":"IF(Tabelle_Statistik[[#This Row],[Teilnahme]]=\"ja\",SUMIF(Tabelle_Auswertung[Autor(in)],Tabelle_Statistik[[#This Row],[Autor(in)]],Tabelle_Auswertung[Punkte]),IF(Tabelle_Statistik[[#This Row],[Autor(in)]]<>\"\",\" - \",\"\"))","v":" - "},{"$f":"IF(Tabelle_Statistik[[#This Row],[Teilnahme]]=\"ja\",RANK(Tabelle_Statistik[[#This Row],[Punkte]],[Punkte],0),IF(Tabelle_Statistik[[#This Row],[Autor(in)]]<>\"\",\" - \",\"\"))","v":" - "},{"$f":"IF(Tabelle_Statistik[[#This Row],[Autor(in)]]<>\"\",IF(COUNTIF(Tabelle_Auswertung[Autor(in)],Tabelle_Statistik[[#This Row],[Autor(in)]])>0,\"ja\",\"nein\"),\"\")","v":"nein"},{"$f":"IF(Tabelle_Statistik[[#This Row],[Platz]]=1,Tabelle_Statistik[[#This Row],[Autor(in)]],\"\")","v":""},{"$f":"IF(Tabelle_Statistik[[#This Row],[Platz]]=2,Tabelle_Statistik[[#This Row],[Autor(in)]],\"\")","v":""},{"$f":"IF(Tabelle_Statistik[[#This Row],[Platz]]=3,Tabelle_Statistik[[#This Row],[Autor(in)]],\"\")","v":""},{"$f":"IF(Tabelle_Statistik[[#This Row],[Platz]]<11,Tabelle_Statistik[[#This Row],[Autor(in)]],\"\")","v":""}]
[{"$f":"IF(AND(Fotografen!$A22<>\"\",Fotografen!$A22<>\" - - -\"),Fotografen!$A22,\"\")","v":"Manfred Wenz"},{"$f":"IF(Tabelle_Statistik[[#This Row],[Teilnahme]]=\"ja\",SUMIF(Tabelle_Auswertung[Autor(in)],Tabelle_Statistik[[#This Row],[Autor(in)]],Tabelle_Auswertung[Punkte]),IF(Tabelle_Statistik[[#This Row],[Autor(in)]]<>\"\",\" - \",\"\"))","v":" - "},{"$f":"IF(Tabelle_Statistik[[#This Row],[Teilnahme]]=\"ja\",RANK(Tabelle_Statistik[[#This Row],[Punkte]],[Punkte],0),IF(Tabelle_Statistik[[#This Row],[Autor(in)]]<>\"\",\" - \",\"\"))","v":" - "},{"$f":"IF(Tabelle_Statistik[[#This Row],[Autor(in)]]<>\"\",IF(COUNTIF(Tabelle_Auswertung[Autor(in)],Tabelle_Statistik[[#This Row],[Autor(in)]])>0,\"ja\",\"nein\"),\"\")","v":"nein"},{"$f":"IF(Tabelle_Statistik[[#This Row],[Platz]]=1,Tabelle_Statistik[[#This Row],[Autor(in)]],\"\")","v":""},{"$f":"IF(Tabelle_Statistik[[#This Row],[Platz]]=2,Tabelle_Statistik[[#This Row],[Autor(in)]],\"\")","v":""},{"$f":"IF(Tabelle_Statistik[[#This Row],[Platz]]=3,Tabelle_Statistik[[#This Row],[Autor(in)]],\"\")","v":""},{"$f":"IF(Tabelle_Statistik[[#This Row],[Platz]]<11,Tabelle_Statistik[[#This Row],[Autor(in)]],\"\")","v":""}]
[{"$f":"IF(AND(Fotografen!$A25<>\"\",Fotografen!$A25<>\" - - -\"),Fotografen!$A25,\"\")","v":"Patricia Spyra"},{"$f":"IF(Tabelle_Statistik[[#This Row],[Teilnahme]]=\"ja\",SUMIF(Tabelle_Auswertung[Autor(in)],Tabelle_Statistik[[#This Row],[Autor(in)]],Tabelle_Auswertung[Punkte]),IF(Tabelle_Statistik[[#This Row],[Autor(in)]]<>\"\",\" - \",\"\"))","v":" - "},{"$f":"IF(Tabelle_Statistik[[#This Row],[Teilnahme]]=\"ja\",RANK(Tabelle_Statistik[[#This Row],[Punkte]],[Punkte],0),IF(Tabelle_Statistik[[#This Row],[Autor(in)]]<>\"\",\" - \",\"\"))","v":" - "},{"$f":"IF(Tabelle_Statistik[[#This Row],[Autor(in)]]<>\"\",IF(COUNTIF(Tabelle_Auswertung[Autor(in)],Tabelle_Statistik[[#This Row],[Autor(in)]])>0,\"ja\",\"nein\"),\"\")","v":"nein"},{"$f":"IF(Tabelle_Statistik[[#This Row],[Platz]]=1,Tabelle_Statistik[[#This Row],[Autor(in)]],\"\")","v":""},{"$f":"IF(Tabelle_Statistik[[#This Row],[Platz]]=2,Tabelle_Statistik[[#This Row],[Autor(in)]],\"\")","v":""},{"$f":"IF(Tabelle_Statistik[[#This Row],[Platz]]=3,Tabelle_Statistik[[#This Row],[Autor(in)]],\"\")","v":""},{"$f":"IF(Tabelle_Statistik[[#This Row],[Platz]]<11,Tabelle_Statistik[[#This Row],[Autor(in)]],\"\")","v":""}]
[{"$f":"IF(AND(Fotografen!$A26<>\"\",Fotografen!$A26<>\" - - -\"),Fotografen!$A26,\"\")","v":"Peter Höhn"},{"$f":"IF(Tabelle_Statistik[[#This Row],[Teilnahme]]=\"ja\",SUMIF(Tabelle_Auswertung[Autor(in)],Tabelle_Statistik[[#This Row],[Autor(in)]],Tabelle_Auswertung[Punkte]),IF(Tabelle_Statistik[[#This Row],[Autor(in)]]<>\"\",\" - \",\"\"))","v":" - "},{"$f":"IF(Tabelle_Statistik[[#This Row],[Teilnahme]]=\"ja\",RANK(Tabelle_Statistik[[#This Row],[Punkte]],[Punkte],0),IF(Tabelle_Statistik[[#This Row],[Autor(in)]]<>\"\",\" - \",\"\"))","v":" - "},{"$f":"IF(Tabelle_Statistik[[#This Row],[Autor(in)]]<>\"\",IF(COUNTIF(Tabelle_Auswertung[Autor(in)],Tabelle_Statistik[[#This Row],[Autor(in)]])>0,\"ja\",\"nein\"),\"\")","v":"nein"},{"$f":"IF(Tabelle_Statistik[[#This Row],[Platz]]=1,Tabelle_Statistik[[#This Row],[Autor(in)]],\"\")","v":""},{"$f":"IF(Tabelle_Statistik[[#This Row],[Platz]]=2,Tabelle_Statistik[[#This Row],[Autor(in)]],\"\")","v":""},{"$f":"IF(Tabelle_Statistik[[#This Row],[Platz]]=3,Tabelle_Statistik[[#This Row],[Autor(in)]],\"\")","v":""},{"$f":"IF(Tabelle_Statistik[[#This Row],[Platz]]<11,Tabelle_Statistik[[#This Row],[Autor(in)]],\"\")","v":""}]
[{"$f":"IF(AND(Fotografen!$A28<>\"\",Fotografen!$A28<>\" - - -\"),Fotografen!$A28,\"\")","v":"Thomas Fuchs"},{"$f":"IF(Tabelle_Statistik[[#This Row],[Teilnahme]]=\"ja\",SUMIF(Tabelle_Auswertung[Autor(in)],Tabelle_Statistik[[#This Row],[Autor(in)]],Tabelle_Auswertung[Punkte]),IF(Tabelle_Statistik[[#This Row],[Autor(in)]]<>\"\",\" - \",\"\"))","v":" - "},{"$f":"IF(Tabelle_Statistik[[#This Row],[Teilnahme]]=\"ja\",RANK(Tabelle_Statistik[[#This Row],[Punkte]],[Punkte],0),IF(Tabelle_Statistik[[#This Row],[Autor(in)]]<>\"\",\" - \",\"\"))","v":" - "},{"$f":"IF(Tabelle_Statistik[[#This Row],[Autor(in)]]<>\"\",IF(COUNTIF(Tabelle_Auswertung[Autor(in)],Tabelle_Statistik[[#This Row],[Autor(in)]])>0,\"ja\",\"nein\"),\"\")","v":"nein"},{"$f":"IF(Tabelle_Statistik[[#This Row],[Platz]]=1,Tabelle_Statistik[[#This Row],[Autor(in)]],\"\")","v":""},{"$f":"IF(Tabelle_Statistik[[#This Row],[Platz]]=2,Tabelle_Statistik[[#This Row],[Autor(in)]],\"\")","v":""},{"$f":"IF(Tabelle_Statistik[[#This Row],[Platz]]=3,Tabelle_Statistik[[#This Row],[Autor(in)]],\"\")","v":""},{"$f":"IF(Tabelle_Statistik[[#This Row],[Platz]]<11,Tabelle_Statistik[[#This Row],[Autor(in)]],\"\")","v":""}]
[{"$f":"IF(AND(Fotografen!$A29<>\"\",Fotografen!$A29<>\" - - -\"),Fotografen!$A29,\"\")","v":"Walter Böse"},{"$f":"IF(Tabelle_Statistik[[#This Row],[Teilnahme]]=\"ja\",SUMIF(Tabelle_Auswertung[Autor(in)],Tabelle_Statistik[[#This Row],[Autor(in)]],Tabelle_Auswertung[Punkte]),IF(Tabelle_Statistik[[#This Row],[Autor(in)]]<>\"\",\" - \",\"\"))","v":" - "},{"$f":"IF(Tabelle_Statistik[[#This Row],[Teilnahme]]=\"ja\",RANK(Tabelle_Statistik[[#This Row],[Punkte]],[Punkte],0),IF(Tabelle_Statistik[[#This Row],[Autor(in)]]<>\"\",\" - \",\"\"))","v":" - "},{"$f":"IF(Tabelle_Statistik[[#This Row],[Autor(in)]]<>\"\",IF(COUNTIF(Tabelle_Auswertung[Autor(in)],Tabelle_Statistik[[#This Row],[Autor(in)]])>0,\"ja\",\"nein\"),\"\")","v":"nein"},{"$f":"IF(Tabelle_Statistik[[#This Row],[Platz]]=1,Tabelle_Statistik[[#This Row],[Autor(in)]],\"\")","v":""},{"$f":"IF(Tabelle_Statistik[[#This Row],[Platz]]=2,Tabelle_Statistik[[#This Row],[Autor(in)]],\"\")","v":""},{"$f":"IF(Tabelle_Statistik[[#This Row],[Platz]]=3,Tabelle_Statistik[[#This Row],[Autor(in)]],\"\")","v":""},{"$f":"IF(Tabelle_Statistik[[#This Row],[Platz]]<11,Tabelle_Statistik[[#This Row],[Autor(in)]],\"\")","v":""}]
[{"$f":"IF(AND(Fotografen!$A30<>\"\",Fotografen!$A30<>\" - - -\"),Fotografen!$A30,\"\")","v":"Wolfgang Brenner"},{"$f":"IF(Tabelle_Statistik[[#This Row],[Teilnahme]]=\"ja\",SUMIF(Tabelle_Auswertung[Autor(in)],Tabelle_Statistik[[#This Row],[Autor(in)]],Tabelle_Auswertung[Punkte]),IF(Tabelle_Statistik[[#This Row],[Autor(in)]]<>\"\",\" - \",\"\"))","v":" - "},{"$f":"IF(Tabelle_Statistik[[#This Row],[Teilnahme]]=\"ja\",RANK(Tabelle_Statistik[[#This Row],[Punkte]],[Punkte],0),IF(Tabelle_Statistik[[#This Row],[Autor(in)]]<>\"\",\" - \",\"\"))","v":" - "},{"$f":"IF(Tabelle_Statistik[[#This Row],[Autor(in)]]<>\"\",IF(COUNTIF(Tabelle_Auswertung[Autor(in)],Tabelle_Statistik[[#This Row],[Autor(in)]])>0,\"ja\",\"nein\"),\"\")","v":"nein"},{"$f":"IF(Tabelle_Statistik[[#This Row],[Platz]]=1,Tabelle_Statistik[[#This Row],[Autor(in)]],\"\")","v":""},{"$f":"IF(Tabelle_Statistik[[#This Row],[Platz]]=2,Tabelle_Statistik[[#This Row],[Autor(in)]],\"\")","v":""},{"$f":"IF(Tabelle_Statistik[[#This Row],[Platz]]=3,Tabelle_Statistik[[#This Row],[Autor(in)]],\"\")","v":""},{"$f":"IF(Tabelle_Statistik[[#This Row],[Platz]]<11,Tabelle_Statistik[[#This Row],[Autor(in)]],\"\")","v":""}]
[{"$f":"IF(AND(Fotografen!$A31<>\"\",Fotografen!$A31<>\" - - -\"),Fotografen!$A31,\"\")","v":"Gast 1"},{"$f":"IF(Tabelle_Statistik[[#This Row],[Teilnahme]]=\"ja\",SUMIF(Tabelle_Auswertung[Autor(in)],Tabelle_Statistik[[#This Row],[Autor(in)]],Tabelle_Auswertung[Punkte]),IF(Tabelle_Statistik[[#This Row],[Autor(in)]]<>\"\",\" - \",\"\"))","v":" - "},{"$f":"IF(Tabelle_Statistik[[#This Row],[Teilnahme]]=\"ja\",RANK(Tabelle_Statistik[[#This Row],[Punkte]],[Punkte],0),IF(Tabelle_Statistik[[#This Row],[Autor(in)]]<>\"\",\" - \",\"\"))","v":" - "},{"$f":"IF(Tabelle_Statistik[[#This Row],[Autor(in)]]<>\"\",IF(COUNTIF(Tabelle_Auswertung[Autor(in)],Tabelle_Statistik[[#This Row],[Autor(in)]])>0,\"ja\",\"nein\"),\"\")","v":"nein"},{"$f":"IF(Tabelle_Statistik[[#This Row],[Platz]]=1,Tabelle_Statistik[[#This Row],[Autor(in)]],\"\")","v":""},{"$f":"IF(Tabelle_Statistik[[#This Row],[Platz]]=2,Tabelle_Statistik[[#This Row],[Autor(in)]],\"\")","v":""},{"$f":"IF(Tabelle_Statistik[[#This Row],[Platz]]=3,Tabelle_Statistik[[#This Row],[Autor(in)]],\"\")","v":""},{"$f":"IF(Tabelle_Statistik[[#This Row],[Platz]]<11,Tabelle_Statistik[[#This Row],[Autor(in)]],\"\")","v":""}]
[{"$f":"IF(AND(Fotografen!$A32<>\"\",Fotografen!$A32<>\" - - -\"),Fotografen!$A32,\"\")","v":"Gast 2"},{"$f":"IF(Tabelle_Statistik[[#This Row],[Teilnahme]]=\"ja\",SUMIF(Tabelle_Auswertung[Autor(in)],Tabelle_Statistik[[#This Row],[Autor(in)]],Tabelle_Auswertung[Punkte]),IF(Tabelle_Statistik[[#This Row],[Autor(in)]]<>\"\",\" - \",\"\"))","v":" - "},{"$f":"IF(Tabelle_Statistik[[#This Row],[Teilnahme]]=\"ja\",RANK(Tabelle_Statistik[[#This Row],[Punkte]],[Punkte],0),IF(Tabelle_Statistik[[#This Row],[Autor(in)]]<>\"\",\" - \",\"\"))","v":" - "},{"$f":"IF(Tabelle_Statistik[[#This Row],[Autor(in)]]<>\"\",IF(COUNTIF(Tabelle_Auswertung[Autor(in)],Tabelle_Statistik[[#This Row],[Autor(in)]])>0,\"ja\",\"nein\"),\"\")","v":"nein"},{"$f":"IF(Tabelle_Statistik[[#This Row],[Platz]]=1,Tabelle_Statistik[[#This Row],[Autor(in)]],\"\")","v":""},{"$f":"IF(Tabelle_Statistik[[#This Row],[Platz]]=2,Tabelle_Statistik[[#This Row],[Autor(in)]],\"\")","v":""},{"$f":"IF(Tabelle_Statistik[[#This Row],[Platz]]=3,Tabelle_Statistik[[#This Row],[Autor(in)]],\"\")","v":""},{"$f":"IF(Tabelle_Statistik[[#This Row],[Platz]]<11,Tabelle_Statistik[[#This Row],[Autor(in)]],\"\")","v":""}]
[{"$f":"IF(AND(Fotografen!$A33<>\"\",Fotografen!$A33<>\" - - -\"),Fotografen!$A33,\"\")","v":"Gast 3"},{"$f":"IF(Tabelle_Statistik[[#This Row],[Teilnahme]]=\"ja\",SUMIF(Tabelle_Auswertung[Autor(in)],Tabelle_Statistik[[#This Row],[Autor(in)]],Tabelle_Auswertung[Punkte]),IF(Tabelle_Statistik[[#This Row],[Autor(in)]]<>\"\",\" - \",\"\"))","v":" - "},{"$f":"IF(Tabelle_Statistik[[#This Row],[Teilnahme]]=\"ja\",RANK(Tabelle_Statistik[[#This Row],[Punkte]],[Punkte],0),IF(Tabelle_Statistik[[#This Row],[Autor(in)]]<>\"\",\" - \",\"\"))","v":" - "},{"$f":"IF(Tabelle_Statistik[[#This Row],[Autor(in)]]<>\"\",IF(COUNTIF(Tabelle_Auswertung[Autor(in)],Tabelle_Statistik[[#This Row],[Autor(in)]])>0,\"ja\",\"nein\"),\"\")","v":"nein"},{"$f":"IF(Tabelle_Statistik[[#This Row],[Platz]]=1,Tabelle_Statistik[[#This Row],[Autor(in)]],\"\")","v":""},{"$f":"IF(Tabelle_Statistik[[#This Row],[Platz]]=2,Tabelle_Statistik[[#This Row],[Autor(in)]],\"\")","v":""},{"$f":"IF(Tabelle_Statistik[[#This Row],[Platz]]=3,Tabelle_Statistik[[#This Row],[Autor(in)]],\"\")","v":""},{"$f":"IF(Tabelle_Statistik[[#This Row],[Platz]]<11,Tabelle_Statistik[[#This Row],[Autor(in)]],\"\")","v":""}]
[{"$f":"IF(AND(Fotografen!$A34<>\"\",Fotografen!$A34<>\" - - -\"),Fotografen!$A34,\"\")","v":"Gast 4"},{"$f":"IF(Tabelle_Statistik[[#This Row],[Teilnahme]]=\"ja\",SUMIF(Tabelle_Auswertung[Autor(in)],Tabelle_Statistik[[#This Row],[Autor(in)]],Tabelle_Auswertung[Punkte]),IF(Tabelle_Statistik[[#This Row],[Autor(in)]]<>\"\",\" - \",\"\"))","v":" - "},{"$f":"IF(Tabelle_Statistik[[#This Row],[Teilnahme]]=\"ja\",RANK(Tabelle_Statistik[[#This Row],[Punkte]],[Punkte],0),IF(Tabelle_Statistik[[#This Row],[Autor(in)]]<>\"\",\" - \",\"\"))","v":" - "},{"$f":"IF(Tabelle_Statistik[[#This Row],[Autor(in)]]<>\"\",IF(COUNTIF(Tabelle_Auswertung[Autor(in)],Tabelle_Statistik[[#This Row],[Autor(in)]])>0,\"ja\",\"nein\"),\"\")","v":"nein"},{"$f":"IF(Tabelle_Statistik[[#This Row],[Platz]]=1,Tabelle_Statistik[[#This Row],[Autor(in)]],\"\")","v":""},{"$f":"IF(Tabelle_Statistik[[#This Row],[Platz]]=2,Tabelle_Statistik[[#This Row],[Autor(in)]],\"\")","v":""},{"$f":"IF(Tabelle_Statistik[[#This Row],[Platz]]=3,Tabelle_Statistik[[#This Row],[Autor(in)]],\"\")","v":""},{"$f":"IF(Tabelle_Statistik[[#This Row],[Platz]]<11,Tabelle_Statistik[[#This Row],[Autor(in)]],\"\")","v":""}]
[{"$f":"IF(AND(Fotografen!$A35<>\"\",Fotografen!$A35<>\" - - -\"),Fotografen!$A35,\"\")","v":"Gast 5"},{"$f":"IF(Tabelle_Statistik[[#This Row],[Teilnahme]]=\"ja\",SUMIF(Tabelle_Auswertung[Autor(in)],Tabelle_Statistik[[#This Row],[Autor(in)]],Tabelle_Auswertung[Punkte]),IF(Tabelle_Statistik[[#This Row],[Autor(in)]]<>\"\",\" - \",\"\"))","v":" - "},{"$f":"IF(Tabelle_Statistik[[#This Row],[Teilnahme]]=\"ja\",RANK(Tabelle_Statistik[[#This Row],[Punkte]],[Punkte],0),IF(Tabelle_Statistik[[#This Row],[Autor(in)]]<>\"\",\" - \",\"\"))","v":" - "},{"$f":"IF(Tabelle_Statistik[[#This Row],[Autor(in)]]<>\"\",IF(COUNTIF(Tabelle_Auswertung[Autor(in)],Tabelle_Statistik[[#This Row],[Autor(in)]])>0,\"ja\",\"nein\"),\"\")","v":"nein"},{"$f":"IF(Tabelle_Statistik[[#This Row],[Platz]]=1,Tabelle_Statistik[[#This Row],[Autor(in)]],\"\")","v":""},{"$f":"IF(Tabelle_Statistik[[#This Row],[Platz]]=2,Tabelle_Statistik[[#This Row],[Autor(in)]],\"\")","v":""},{"$f":"IF(Tabelle_Statistik[[#This Row],[Platz]]=3,Tabelle_Statistik[[#This Row],[Autor(in)]],\"\")","v":""},{"$f":"IF(Tabelle_Statistik[[#This Row],[Platz]]<11,Tabelle_Statistik[[#This Row],[Autor(in)]],\"\")","v":""}]
[{"$f":"IF(AND(Fotografen!$A36<>\"\",Fotografen!$A36<>\" - - -\"),Fotografen!$A36,\"\")","v":"Gast 6"},{"$f":"IF(Tabelle_Statistik[[#This Row],[Teilnahme]]=\"ja\",SUMIF(Tabelle_Auswertung[Autor(in)],Tabelle_Statistik[[#This Row],[Autor(in)]],Tabelle_Auswertung[Punkte]),IF(Tabelle_Statistik[[#This Row],[Autor(in)]]<>\"\",\" - \",\"\"))","v":" - "},{"$f":"IF(Tabelle_Statistik[[#This Row],[Teilnahme]]=\"ja\",RANK(Tabelle_Statistik[[#This Row],[Punkte]],[Punkte],0),IF(Tabelle_Statistik[[#This Row],[Autor(in)]]<>\"\",\" - \",\"\"))","v":" - "},{"$f":"IF(Tabelle_Statistik[[#This Row],[Autor(in)]]<>\"\",IF(COUNTIF(Tabelle_Auswertung[Autor(in)],Tabelle_Statistik[[#This Row],[Autor(in)]])>0,\"ja\",\"nein\"),\"\")","v":"nein"},{"$f":"IF(Tabelle_Statistik[[#This Row],[Platz]]=1,Tabelle_Statistik[[#This Row],[Autor(in)]],\"\")","v":""},{"$f":"IF(Tabelle_Statistik[[#This Row],[Platz]]=2,Tabelle_Statistik[[#This Row],[Autor(in)]],\"\")","v":""},{"$f":"IF(Tabelle_Statistik[[#This Row],[Platz]]=3,Tabelle_Statistik[[#This Row],[Autor(in)]],\"\")","v":""},{"$f":"IF(Tabelle_Statistik[[#This Row],[Platz]]<11,Tabelle_Statistik[[#This Row],[Autor(in)]],\"\")","v":""}]
[{"$f":"IF(AND(Fotografen!$A37<>\"\",Fotografen!$A37<>\" - - -\"),Fotografen!$A37,\"\")","v":"Gast 7"},{"$f":"IF(Tabelle_Statistik[[#This Row],[Teilnahme]]=\"ja\",SUMIF(Tabelle_Auswertung[Autor(in)],Tabelle_Statistik[[#This Row],[Autor(in)]],Tabelle_Auswertung[Punkte]),IF(Tabelle_Statistik[[#This Row],[Autor(in)]]<>\"\",\" - \",\"\"))","v":" - "},{"$f":"IF(Tabelle_Statistik[[#This Row],[Teilnahme]]=\"ja\",RANK(Tabelle_Statistik[[#This Row],[Punkte]],[Punkte],0),IF(Tabelle_Statistik[[#This Row],[Autor(in)]]<>\"\",\" - \",\"\"))","v":" - "},{"$f":"IF(Tabelle_Statistik[[#This Row],[Autor(in)]]<>\"\",IF(COUNTIF(Tabelle_Auswertung[Autor(in)],Tabelle_Statistik[[#This Row],[Autor(in)]])>0,\"ja\",\"nein\"),\"\")","v":"nein"},{"$f":"IF(Tabelle_Statistik[[#This Row],[Platz]]=1,Tabelle_Statistik[[#This Row],[Autor(in)]],\"\")","v":""},{"$f":"IF(Tabelle_Statistik[[#This Row],[Platz]]=2,Tabelle_Statistik[[#This Row],[Autor(in)]],\"\")","v":""},{"$f":"IF(Tabelle_Statistik[[#This Row],[Platz]]=3,Tabelle_Statistik[[#This Row],[Autor(in)]],\"\")","v":""},{"$f":"IF(Tabelle_Statistik[[#This Row],[Platz]]<11,Tabelle_Statistik[[#This Row],[Autor(in)]],\"\")","v":""}]
[{"$f":"IF(AND(Fotografen!$A38<>\"\",Fotografen!$A38<>\" - - -\"),Fotografen!$A38,\"\")","v":"Gast 8"},{"$f":"IF(Tabelle_Statistik[[#This Row],[Teilnahme]]=\"ja\",SUMIF(Tabelle_Auswertung[Autor(in)],Tabelle_Statistik[[#This Row],[Autor(in)]],Tabelle_Auswertung[Punkte]),IF(Tabelle_Statistik[[#This Row],[Autor(in)]]<>\"\",\" - \",\"\"))","v":" - "},{"$f":"IF(Tabelle_Statistik[[#This Row],[Teilnahme]]=\"ja\",RANK(Tabelle_Statistik[[#This Row],[Punkte]],[Punkte],0),IF(Tabelle_Statistik[[#This Row],[Autor(in)]]<>\"\",\" - \",\"\"))","v":" - "},{"$f":"IF(Tabelle_Statistik[[#This Row],[Autor(in)]]<>\"\",IF(COUNTIF(Tabelle_Auswertung[Autor(in)],Tabelle_Statistik[[#This Row],[Autor(in)]])>0,\"ja\",\"nein\"),\"\")","v":"nein"},{"$f":"IF(Tabelle_Statistik[[#This Row],[Platz]]=1,Tabelle_Statistik[[#This Row],[Autor(in)]],\"\")","v":""},{"$f":"IF(Tabelle_Statistik[[#This Row],[Platz]]=2,Tabelle_Statistik[[#This Row],[Autor(in)]],\"\")","v":""},{"$f":"IF(Tabelle_Statistik[[#This Row],[Platz]]=3,Tabelle_Statistik[[#This Row],[Autor(in)]],\"\")","v":""},{"$f":"IF(Tabelle_Statistik[[#This Row],[Platz]]<11,Tabelle_Statistik[[#This Row],[Autor(in)]],\"\")","v":""}]
[{"$f":"IF(AND(Fotografen!$A39<>\"\",Fotografen!$A39<>\" - - -\"),Fotografen!$A39,\"\")","v":"Gast 9"},{"$f":"IF(Tabelle_Statistik[[#This Row],[Teilnahme]]=\"ja\",SUMIF(Tabelle_Auswertung[Autor(in)],Tabelle_Statistik[[#This Row],[Autor(in)]],Tabelle_Auswertung[Punkte]),IF(Tabelle_Statistik[[#This Row],[Autor(in)]]<>\"\",\" - \",\"\"))","v":" - "},{"$f":"IF(Tabelle_Statistik[[#This Row],[Teilnahme]]=\"ja\",RANK(Tabelle_Statistik[[#This Row],[Punkte]],[Punkte],0),IF(Tabelle_Statistik[[#This Row],[Autor(in)]]<>\"\",\" - \",\"\"))","v":" - "},{"$f":"IF(Tabelle_Statistik[[#This Row],[Autor(in)]]<>\"\",IF(COUNTIF(Tabelle_Auswertung[Autor(in)],Tabelle_Statistik[[#This Row],[Autor(in)]])>0,\"ja\",\"nein\"),\"\")","v":"nein"},{"$f":"IF(Tabelle_Statistik[[#This Row],[Platz]]=1,Tabelle_Statistik[[#This Row],[Autor(in)]],\"\")","v":""},{"$f":"IF(Tabelle_Statistik[[#This Row],[Platz]]=2,Tabelle_Statistik[[#This Row],[Autor(in)]],\"\")","v":""},{"$f":"IF(Tabelle_Statistik[[#This Row],[Platz]]=3,Tabelle_Statistik[[#This Row],[Autor(in)]],\"\")","v":""},{"$f":"IF(Tabelle_Statistik[[#This Row],[Platz]]<11,Tabelle_Statistik[[#This Row],[Autor(in)]],\"\")","v":""}]

{"sheet":"Top 10 Bilder","index":2,"n_rows":15,"n_cols":2,"rows_kept":15,"merged":[[0,0,3,1]]}
["TOP 10 Bilder"]
[]
[]
[]
["Platz","Bild(er)"]
[1,{"$f":"VERKETTEN_P1(Tabelle_Auswertung[Platz 1],CHAR(10))","v":"Glubschaugen.JPG von Nadja Cassim\nüber_den_Wolken-2.jpg von Oliver von Guérard"}]
[2,{"$f":"VERKETTEN_P1(Tabelle_Auswertung[Platz 2],CHAR(10))","v":""}]
[3,{"$f":"VERKETTEN_P1(Tabelle_Auswertung[Platz 3],CHAR(10))","v":"Turm im Nebel.JPG von Susanne Deinhardt"}]
[4,{"$f":"VERKETTEN_P1(Tabelle_Auswertung[Platz 4],CHAR(10))","v":"Flying Banana.jpg von Jan Grünler"}]
[5,{"$f":"VERKETTEN_P1(Tabelle_Auswertung[Platz 5],CHAR(10))","v":"tower bridge.jpg von Gerhard Rieß"}]
[6,{"$f":"VERKETTEN_P1(Tabelle_Auswertung[Platz 6],CHAR(10))","v":"Löwenzahn.jpg von Susanne Deinhardt"}]
[7,{"$f":"VERKETTEN_P1(Tabelle_Auswertung[Platz 6],CHAR(10))","v":"Löwenzahn.jpg von Susanne Deinhardt"}]
[8,{"$f":"VERKETTEN_P1(Tabelle_Auswertung[Platz 8],CHAR(10))","v":""}]
[9,{"$f":"VERKETTEN_P1(Tabelle_Auswertung[Platz 9],CHAR(10))","v":"bright eyes.jpg von Jan Grünler"}]
[10,{"$f":"VERKETTEN_P1(Tabelle_Auswertung[Platz 10],CHAR(10))","v":"Tropfen.JPG von Susanne Deinhardt"}]

{"sheet":"Fotografen","index":3,"n_rows":39,"n_cols":1,"rows_kept":39}
["Autoren"]
[" - - -"]
["Albrecht Flierl"]
["Alexander Häberlein"]
["Andreas Toltz"]
["Antje Finsterer"]
["Bernd Kober"]
["Chris Finsterer"]
["Claudia Dommel"]
["Georg Held"]
["Georg Lindörfer"]
["Gerhard Rieß"]
["Gert Häberlein"]
["Günter Buckl"]
["Günter Wieser"]
["Günther Arold"]
["Jan Grünler"]
["Jürgen Abt"]
["Klaus Leitloff"]
["Klaus Lindörfer"]
["Manfred Schwab"]
["Manfred Wenz"]
["Nadja Cassim"]
["Oliver von Guérard"]
["Patricia Spyra"]
["Peter Höhn"]
["Susanne Deinhardt"]
["Thomas Fuchs"]
["Walter Böse"]
["Wolfgang Brenner"]
["Gast 1"]
["Gast 2"]
["Gast 3"]
["Gast 4"]
["Gast 5"]
["Gast 6"]
["Gast 7"]
["Gast 8"]
["Gast 9"]

{"sheet":"online","index":4,"n_rows":1,"n_cols":11,"rows_kept":1}
["Sortierung","Titel","Punkte","Schnitt","Platz","Fotograf/in","Tags",null,"Fotograf/in","Gesamtpunkte","Platz"]